Mailinglist Archive: opensuse-packaging (130 mails)

< Previous Next >
Re: [opensuse-packaging] codelite build breaks for openSUSE <=11.1
  • From: Michal Marek <mmarek@xxxxxxx>
  • Date: Thu, 04 Mar 2010 14:09:30 +0100
  • Message-id: <4B8FB10A.5000707@xxxxxxx>
On 3.3.2010 17:10, Dominique Leuenberger wrote:
The fact that your makefile is using parallel build (-j 4) helped it
to hide the error a bit from you and it's not at the end....

BTW, we use the attached script for blaming people who break something
in the kernel git. I would be nice to have something like that in the
buildservice web interface, now that the buildservice uses parallel
make. The output looks like this:

$ osc rbl home:Fisiu CodeLite openSUSE_11.1 x86_64 | \
../Interfaces/plugin.h:31:27: error: wx/aui/auibar.h: No such file or
../Interfaces/plugin.h:291: error: ISO C++ forbids declaration of
with no type
../Interfaces/plugin.h:291: error: 'wxAuiToolBar' declared as a
'virtual' field
../Interfaces/plugin.h:291: error: expected ';' before '*' token
gizmos.h:51: error: ISO C++ forbids declaration of 'wxAuiToolBar' with
no type
gizmos.h:51: error: 'wxAuiToolBar' declared as a 'virtual' field
gizmos.h:51: error: expected ';' before '*' token
gizmos.h:71: error: 'wxAuiToolBarEvent' has not been declared
gizmos.cpp:173: error: expected constructor, destructor, or type
conversion befo
re '*' token
gizmos.cpp:143: warning: 'void WriteFile(const wxString&, const
wxString&)' defi
ned but not used
gizmos.cpp:154: warning: 'void WriteNamespacesDeclaration(const
wxString&)' defined but not used
make[1]: *** [Release_gcc_unicode/gizmos.o] Error 1
make[1]: Leaving directory
make: *** [Gizmos] Error 2
g++ -DON_64_BIT -O3 -DREGEXP_UNICODE -c debuggergdb.cpp -fPIC -Wall
lib64/wx/include/gtk2-unicode-release-2.8 -I/usr/include/wx-2.8
ITS=64 -D_LARGE_FILES -D__WXGTK__ -pthread -fno-strict-aliasing
usr/share/codelite\" -DPLUGINS_DIR=\"/usr/lib64/codelite\"
-2.0 -I/usr/lib64/gtk-2.0/include -I/usr/include/atk-1.0
-I/usr/include/cairo -I
/usr/include/pango-1.0 -I/usr/include/glib-2.0
-I/usr/lib64/glib-2.0/include -I/
usr/include/pixman-1 -I/usr/include/freetype2 -I/usr/include/libpng12
-I. -I..
/sdk/codelite_indexer/network -I../sdk/wxsqlite3/include
te3/include -I../sdk/wxscintilla/include
ude -I../sdk/wxscintilla/src/scintilla/src -I../Interfaces -I../Debugger
ugin -I../CodeLite -o Release_gcc_unicode/debuggergdb.o
make: *** Waiting for unfinished jobs....

#!/usr/bin/awk -f

max_context = 2;
context[""] = 0;

function print_context()
for (i = 0; i < max_context; i++)
if (context[i])
print context[i];

function print_error()
delete context;

/: ((internal compiler |Internal )?error|sorry, unimplemented):| needs unknown
symbol | modversion changed |: undefined reference / {

# we might not know what caused this error, better print some context
/^make.*: \*\*\*/ {

for (i = 0; i < max_context - 1; i++)
context[i] = context[i + 1];
context[max_context - 1] = $0;
< Previous Next >