Mailinglist Archive: opensuse-packaging (183 mails)

< Previous Next >
[opensuse-packaging] New Version of skrooge
  • From: "Sascha 'saigkill' Manns" <samannsml@xxxxxxxxxxxxx>
  • Date: Mon, 1 Jun 2009 14:21:52 +0200
  • Message-id: <200906011421.54658@xxxxxxxxxxxxxxxxxxx>
Hello Mates,

yesterday i've recieved the Information about the new Version from
skrooge.
It builds for 11.1 and Factory perfectly. But for 11.0 he says:
[ 53%] Building CXX object
skrooge_monthly/CMakeFiles/skrooge_monthly.dir/skrooge_monthly.o
Linking CXX shared module ../lib/skrooge_monthly.so
CMakeFiles/skrooge_monthly.dir/skgmonthlypluginwidget.o: In function
`SKGMonthlyPluginWidget::onMonthChanged()':
skgmonthlypluginwidget.cpp:(.text+0xbb8): undefined reference to
`QWebView::setHtml(QString const&, QUrl const&)'
skgmonthlypluginwidget.cpp:(.text+0xe3d): undefined reference to
`QWebView::setHtml(QString const&, QUrl const&)'
CMakeFiles/skrooge_monthly.dir/skgmonthlypluginwidget.o: In function
`Ui_skgmonthlyplugin_base::setupUi(QWidget*)':
skgmonthlypluginwidget.cpp:
(.text._ZN24Ui_skgmonthlyplugin_base7setupUiEP7QWidget[Ui_skgmonthlyplugin_base::setupUi(QWidget*)]+0x507):

undefined reference to `QWebView::QWebView(QWidget*)'
skgmonthlypluginwidget.cpp:
(.text._ZN24Ui_skgmonthlyplugin_base7setupUiEP7QWidget[Ui_skgmonthlyplugin_base::setupUi(QWidget*)]+0x580):

undefined reference to `QWebView::setUrl(QUrl const&)'
collect2: ld returned 1 exit status
make[2]: *** [lib/skrooge_monthly.so] Error 1
make[1]: *** [skrooge_monthly/CMakeFiles/skrooge_monthly.dir/all] Error
2
make: *** [all] Error 2
error: Bad exit status from /var/tmp/rpm-tmp.69872 (%build)

Doe's anyone understand this BuildLog? What's wrong?
--
Sincereley yours

Sascha Manns
openSUSE Marketing Team
openSUSE Build Service
openSUSE Features Screening Team
Web: http://saschamanns.gulli.to
Project-Blog: http://lizards.opensuse.org/author/saigkill
Private-Blog: http://saschasbacktrace.blogspot.com
< Previous Next >
Follow Ups