Mailinglist Archive: opensuse-buildservice (63 mails)

< Previous Next >
Re: [opensuse-buildservice] Centos 7 x86_64, missing binutils/ld
On Dienstag, 15. Mai 2018, 08:44:27 CEST wrote Stefan van der Eijk:
Where / how do I do that?
with kind regards, / met vriendelijke groet,

it should not be needed anymore, after I updated the default config of CentOS 7
matching these changes.

It should just work for you now.

Stefan van der Eijk


On Tue, May 15, 2018 at 8:35 AM, Adrian Schröter <adrian@xxxxxxx> wrote:
On Montag, 14. Mai 2018, 09:57:12 CEST wrote Boris Manojlovic:
sorry i tried to reply earlier but was greeted by error as i just
pressed reply without setting mail to plain/text (yay)

in project settings add
%if 0%{?centos_version}
Preinstall: chkconfig
%endif
that should provide you with alternatives which in background installs
symbolic link for ld and other utlis

thanks, adapted the config now.

On Sun, May 13, 2018 at 11:20 AM, Stefan van der Eijk
<stefan.van.der.eijk@xxxxxxxxx> wrote:
I'm also getting a weird one:

https://build.opensuse.org/package/live_build_log/home:stefan_van_der_eijk/rgxg/CentOS_7/x86_64

[ 67s] checking for gcc... gcc
[ 67s] checking whether the C compiler works... no
[ 67s] configure: error: in `/home/abuild/rpmbuild/BUILD/rgxg-0.1.1':
[ 67s] configure: error: C compiler cannot create executables
[ 67s] See `config.log' for more details
[ 67s] error: Bad exit status from /var/tmp/rpm-tmp.SFjBM8 (%build)

with kind regards, / met vriendelijke groet,

Stefan van der Eijk

On Sun, May 13, 2018 at 10:08 AM, Sebastian <sebix@xxxxxxxx> wrote:

Hi,

On 05/10/2018 10:38 AM, Andreas Baumann wrote:
For instance on
https://build.opensuse.org/package/live_build_log/home:andreas_baumann/gengetopt/CentOS_7/x86_64

[ 66s] collect2: fatal error: cannot find 'ld'
[ 66s] compilation terminated.

Additional to the missing ld program I also get this error for CentOS 7:

[ 80s] File "setup.py", line 278, in run
[ 80s] raise RuntimeError("autoconf error")
[ 80s] RuntimeError: autoconf error

https://build.opensuse.org/package/live_build_log/home:sebix:intelmq/python3-pycrypto/CentOS_7/x86_64


and this:
[ 70s] checking for gcc... gcc
[ 70s] checking whether the C compiler works... no
[ 70s] configure: error: in
`/home/abuild/rpmbuild/BUILD/jemalloc-3.6.0':
[ 70s] configure: error: C compiler cannot create executables
[ 70s] See `config.log' for more details

https://build.opensuse.org/package/live_build_log/home:sebix:EPEL:7/jemalloc/CentOS_7/x86_64

Sebastian

--
python programming - mail server - photo - video - https://sebix.at
cryptographic key at https://sebix.at/DC9B463B.asc and on public
keyservers


--
To unsubscribe, e-mail: opensuse-buildservice+unsubscribe@xxxxxxxxxxxx
To contact the owner, e-mail: opensuse-buildservice+owner@xxxxxxxxxxxx




--

Adrian Schroeter
email: adrian@xxxxxxx

SUSE Linux GmbH, GF: Felix Imendörffer, Jane Smithard, Graham Norton, HRB
21284 (AG Nürnberg)

Maxfeldstraße 5
90409 Nürnberg
Germany







--

Adrian Schroeter
email: adrian@xxxxxxx

SUSE Linux GmbH, GF: Felix Imendörffer, Jane Smithard, Graham Norton, HRB 21284
(AG Nürnberg)

Maxfeldstraße 5
90409 Nürnberg
Germany




--
To unsubscribe, e-mail: opensuse-buildservice+unsubscribe@xxxxxxxxxxxx
To contact the owner, e-mail: opensuse-buildservice+owner@xxxxxxxxxxxx

< Previous Next >
Follow Ups