Mailinglist Archive: opensuse-buildservice (63 mails)

< Previous Next >
Re: [opensuse-buildservice] Centos 7 x86_64, missing binutils/ld

On 05/10/2018 10:38 AM, Andreas Baumann wrote:
For instance on

[ 66s] collect2: fatal error: cannot find 'ld'
[ 66s] compilation terminated.

Additional to the missing ld program I also get this error for CentOS 7:

[ 80s] File "", line 278, in run
[ 80s] raise RuntimeError("autoconf error")
[ 80s] RuntimeError: autoconf error

and this:
[ 70s] checking for gcc... gcc
[ 70s] checking whether the C compiler works... no
[ 70s] configure: error: in `/home/abuild/rpmbuild/BUILD/jemalloc-3.6.0':
[ 70s] configure: error: C compiler cannot create executables
[ 70s] See `config.log' for more details


python programming - mail server - photo - video -
cryptographic key at and on public keyservers

< Previous Next >
Follow Ups