Mailinglist Archive: opensuse-buildservice (216 mails)

< Previous Next >
Re: [opensuse-buildservice] Modules Error during build
  • From: Adrian Schröter <adrian@xxxxxxx>
  • Date: Mon, 22 Mar 2010 14:58:56 +0100
  • Message-id: <201003221458.56996.adrian@xxxxxxx>
Am Montag, 22. März 2010 14:15:38 schrieb Jan.Albrecht@xxxxxxxxxxxxxx:
Hi,

currently we try to build a package, but that does fail.

************************************************

build36 started "build heartbeat-suse.spec" at Mon Mar 22 11:31:58 UTC 2010.

Building heartbeat for project 'home:nmidc:pacemaker' repository 'SLE_10'
arch 'i586' srcmd5 '5ec8f40fddb197fbcc22c7910573fded'

[.]

modprobe: FATAL: Could not load /lib/modules/2.6.27.42-0.1-xen/modules.dep:
No such file or directory

error : Resource temporarily unavailable
warning: failed to load external entity
"http://docbook.sourceforge.net/release/xsl/current/manpages/docbook.xsl";
cannot parse
http://docbook.sourceforge.net/release/xsl/current/manpages/docbook.xsl
gmake[1]: *** [heartbeat.8] Error 4
gmake[1]: *** Waiting for unfinished jobs....
modprobe: FATAL: Could not load /lib/modules/2.6.27.42-0.1-xen/modules.dep:
No such file or directory

error : Resource temporarily unavailable
warning: failed to load external entity
"http://docbook.sourceforge.net/release/xsl/current/manpages/docbook.xsl";
cannot parse
http://docbook.sourceforge.net/release/xsl/current/manpages/docbook.xsl
gmake[1]: *** [apphbd.8] Error 4
modprobe: FATAL: Could not load /lib/modules/2.6.27.42-0.1-xen/modules.dep:
No such file or directory

error : Resource temporarily unavailable
warning: failed to load external entity
"http://docbook.sourceforge.net/release/xsl/current/manpages/docbook.xsl";
cannot parse
http://docbook.sourceforge.net/release/xsl/current/manpages/docbook.xsl
gmake[1]: *** [cl_status.1] Error 4
make: *** [all-recursive] Error 1
error: Bad exit status from /var/tmp/rpm-tmp.50233 (%build)


RPM build errors:
cannot open Pubkeys index using db3 - No such file or directory (2)
Bad exit status from /var/tmp/rpm-tmp.50233 (%build)
modprobe: FATAL: Could not load /lib/modules/2.6.27.42-0.1-xen/modules.dep:
No such file or directory

error : Resource temporarily unavailable
warning: failed to load external entity
"http://docbook.sourceforge.net/release/xsl/current/manpages/docbook.xsl";
cannot parse
http://docbook.sourceforge.net/release/xsl/current/manpages/docbook.xsl

It looks to me that something in your build env triggers the load of kernel
modules.
This should never be the case, because a build should never depend on the
running
kernel (but it can depend on installed kernel sources).

(It could be also a broken build36, but current running builds on it look good).

bye
adrian

--

Adrian Schroeter
SUSE Linux Products GmbH
email: adrian@xxxxxxx

--
To unsubscribe, e-mail: opensuse-buildservice+unsubscribe@xxxxxxxxxxxx
For additional commands, e-mail: opensuse-buildservice+help@xxxxxxxxxxxx

< Previous Next >
References