Mailinglist Archive: opensuse-bugs (3843 mails)

by date

< Previous 1 | 2 | 3 | 4 | 5 | 6 | 7 | 8 | 9 | 10 | 11 | 12 | 13 | 14 | 15 | 16 Next >

01 November, 2018

01:57 bugzilla_noreply [Bug 1114267] New: with kernel-default 4.19.0-3.1, don't start X
04:30 bugzilla_noreply [Bug 1114008] SSH access fails after upgrade to openssh-7.8p1-1.1.x86_64
05:59 bugzilla_noreply [Bug 1114008] SSH access fails after upgrade to openssh-7.8p1-1.1.x86_64
06:34 bugzilla_noreply [Bug 1112464] after 20181015 and kernel 4.18.13-1-default nouveau fails to start secondary screen on Nvidia quadro
06:51 bugzilla_noreply [Bug 1084943] NetworkManager with autoconnect enabled displays error messages
06:54 bugzilla_noreply [Bug 1084943] NetworkManager with autoconnect enabled displays error messages
07:24 bugzilla_noreply [Bug 1113946] ceph build fails in openSUSE:Factory:Staging:C
07:31 bugzilla_noreply [Bug 1113946] ceph build fails in openSUSE:Factory:Staging:C
07:36 bugzilla_noreply [Bug 1114273] New: Broadband connection established but all packages dropped
07:38 bugzilla_noreply [Bug 1113946] ceph build fails in openSUSE:Factory:Staging:C
07:39 bugzilla_noreply [Bug 1113946] ceph build fails in openSUSE:Factory:Staging:C
07:39 bugzilla_noreply [Bug 1113946] ceph build fails in openSUSE:Factory:Staging:C
07:41 bugzilla_noreply [Bug 1113946] ceph build fails in openSUSE:Factory:Staging:C
07:43 bugzilla_noreply [Bug 893359] clang fails to compile helloworld on ARM
07:43 bugzilla_noreply [Bug 1065464] Don't allow multiple OpenCL ICD packages to be installed simultaneously
07:43 bugzilla_noreply [Bug 991901] DENIED errors for smb, nmbd & winbindd
07:44 bugzilla_noreply [Bug 1106838] system does not boot up due to ccp (AMD Secure Processor driver) module
07:45 bugzilla_noreply [Bug 1041469] llvm4 spec issues
07:45 bugzilla_noreply [Bug 1049703] llvm built with unsupported BUILD_SHARED_LIBS
07:48 bugzilla_noreply [Bug 1114267] with kernel-default 4.19.0-3.1, don't start X
07:49 bugzilla_noreply [Bug 1114248] display-manager.service timeouts with Xorg
07:51 bugzilla_noreply [Bug 1050305] Libreoffice extension 'Language Tool' fails after Tumbleweed update
08:00 bugzilla_noreply [Bug 1084943] NetworkManager with autoconnect enabled displays error messages
08:11 bugzilla_noreply [Bug 1084943] NetworkManager with autoconnect enabled displays error messages
08:19 bugzilla_noreply [Bug 1092737] [Build 20180508] openQA test fails in hexchat - Wrong visualization for special characters and numbers.
08:47 bugzilla_noreply [Bug 1110669] twisted.internet.gireactor (python3-Twisted) requires pygtkcompat
08:48 bugzilla_noreply [Bug 1112769] login.defs uid/gid values during autoyast install not respected
08:48 bugzilla_noreply [Bug 1112769] login.defs uid/gid values during autoyast install not respected
09:01 bugzilla_noreply [Bug 1112769] login.defs uid/gid values during autoyast install not respected
09:13 bugzilla_noreply [Bug 1114008] SSH access fails after upgrade to openssh-7.8p1-1.1.x86_64
09:16 bugzilla_noreply [Bug 931296] [plasma5 packaging] cannot unlock locked screen (kcheckpass failure)
09:19 bugzilla_noreply [Bug 1113543] FreeDOS 1.2 isn't detected by os-prober
10:04 bugzilla_noreply [Bug 1084943] NetworkManager with autoconnect enabled displays error messages
10:18 bugzilla_noreply [Bug 1112963] AST Video Kernel Mode Driver is broken
10:20 bugzilla_noreply [Bug 1114062] mousepad: font settings are ignored
12:30 bugzilla_noreply [Bug 1114287] New: package build fails
12:30 bugzilla_noreply [Bug 1090193] yast online repo module does not support $releasever
12:37 bugzilla_noreply [Bug 1108977] Tracker bug for known incompatibilities with OpenSSL 1.1.1
12:39 bugzilla_noreply [Bug 1114213] yast network configuration name server bad error message
12:48 bugzilla_noreply [Bug 1114008] SSH access fails after upgrade to openssh-7.8p1-1.1.x86_64
12:53 bugzilla_noreply [Bug 1112464] after 20181015 and kernel 4.18.13-1-default nouveau fails to start secondary screen on Nvidia quadro
13:02 bugzilla_noreply [Bug 1114251] NVIDIA driver components have different versions
13:05 bugzilla_noreply [Bug 1114251] NVIDIA driver components have different versions
13:22 bugzilla_noreply [Bug 1112963] AST Video Kernel Mode Driver is broken
13:33 bugzilla_noreply [Bug 1112937] find a way to configure using online updates during installation
13:33 bugzilla_noreply [Bug 1112937] find a way to configure using online updates during installation
14:14 bugzilla_noreply [Bug 1112963] AST Video Kernel Mode Driver is broken
14:16 bugzilla_noreply [Bug 1114118] yast2-configuration-management build failed with yast-rake update?
14:16 bugzilla_noreply [Bug 1112963] AST Video Kernel Mode Driver is broken
14:55 bugzilla_noreply [Bug 1096884] Firewalld prevents shutdown or reboot on iMac
14:59 bugzilla_noreply [Bug 1108567] qBittorrent crashes in latest Tumbleweed snapshot
15:25 bugzilla_noreply [Bug 1112963] AST Video Kernel Mode Driver is broken
15:40 bugzilla_noreply [Bug 1113211] Chromium 70 update broke video playback on AMD videocards
15:42 bugzilla_noreply [Bug 1107941] machines.target not enabled by default
15:57 bugzilla_noreply [Bug 1099769] btrfs balance generates 100% CPU usage for long periods (15min's +)
16:17 bugzilla_noreply [Bug 1106838] system does not boot up due to ccp (AMD Secure Processor driver) module
16:50 bugzilla_noreply [Bug 1108134] libcdio update breaks vcdimager build
17:11 bugzilla_noreply [Bug 1114008] SSH access fails after upgrade to openssh-7.8p1-1.1.x86_64
17:17 bugzilla_noreply [Bug 1109832] libvirt-daemon-config-network not installed by yast vm
17:19 bugzilla_noreply [Bug 1107777] Can't connect to wifi network after suspend (not always)
18:54 bugzilla_noreply [Bug 1113586] XEN: kernel BUG at ../drivers/block/xen-blkfront.c:338!
19:18 bugzilla_noreply [Bug 1099419] Wrong package version for Tumbleweed on https://software.opensuse.org/package/gnome-shell
19:32 bugzilla_noreply [Bug 931296] [plasma5 packaging] cannot unlock locked screen (kcheckpass failure)
19:35 bugzilla_noreply [Bug 1114251] NVIDIA driver components have different versions
19:38 bugzilla_noreply [Bug 1114258] Latest update of kcheckpass breaks custom PAM configuration
19:42 bugzilla_noreply [Bug 1103356] nouveau: fan stays on maximum speed after fanboost
19:43 bugzilla_noreply [Bug 1105536] Spectre V2 : System has more than MAX_PA/2 memory. L1TF mitigation not effective.
19:44 bugzilla_noreply [Bug 1111506] KVM cannot start until drop_caches
19:46 bugzilla_noreply [Bug 1113151] Out of date package: openSUSE:Factory/libisoburn is out of date
19:47 bugzilla_noreply [Bug 1113586] XEN: kernel BUG at ../drivers/block/xen-blkfront.c:338!
20:33 bugzilla_noreply [Bug 1114258] Latest update of kcheckpass breaks custom PAM configuration
20:57 bugzilla_noreply [Bug 1114251] NVIDIA driver components have different versions
21:28 bugzilla_noreply [Bug 1114251] NVIDIA driver components have different versions
21:48 bugzilla_noreply [Bug 1114380] New: firefox.desktop[7874]: (firefox:7874): Gtk-WARNING **: Theme parsing error: <data>:1:34: Expected ')' in color definition
21:50 bugzilla_noreply [Bug 1114258] Latest update of kcheckpass breaks custom PAM configuration
21:52 bugzilla_noreply [Bug 1114382] New: "Optional update to add gcc8" is incomplete
22:02 bugzilla_noreply [Bug 1114383] New: chkstat is not always called after Zypper has installed packages
22:17 bugzilla_noreply [Bug 931296] [plasma5 packaging] cannot unlock locked screen (kcheckpass failure)
22:41 bugzilla_noreply [Bug 1114008] SSH access fails after upgrade to openssh-7.8p1-1.1.x86_64
22:54 bugzilla_noreply [Bug 1112817] Firefox 63 requires rust >= 1.28
23:45 bugzilla_noreply [Bug 1114385] New: raspberry pi 3: leap 15 kernel freeze when multiple /dev/ttyUSBx devices get opened

02 November, 2018

00:37 bugzilla_noreply [Bug 1113199] ipv6 is not enabled correctly on bridges
01:40 bugzilla_noreply [Bug 1114388] New: yast get error while update time with ntp server like pool.ntp.org
02:06 bugzilla_noreply [Bug 1114391] New: nm-applet background not painted in lxpanel
02:08 bugzilla_noreply [Bug 1114391] nm-applet background not painted in lxpanel
03:52 bugzilla_noreply [Bug 1114008] SSH access fails after upgrade to openssh-7.8p1-1.1.x86_64
04:49 bugzilla_noreply [Bug 1089077] rust build time
04:50 bugzilla_noreply [Bug 1089077] rust build time
04:54 bugzilla_noreply [Bug 1100672] Cargo/Rustc fails on tumbleweed container
04:54 bugzilla_noreply [Bug 1112817] Firefox 63 requires rust >= 1.28
06:22 bugzilla_noreply [Bug 1114404] New: NetworkManager segfault: error 6 in libc-2.27.so
06:42 bugzilla_noreply [Bug 1077015] zypper dup/up on Btrfs consume 100% CPU and freeze desktop
06:42 bugzilla_noreply [Bug 1032027] btrfs cleaner => freeze
06:48 bugzilla_noreply [Bug 1032027] btrfs cleaner => freeze
06:48 bugzilla_noreply [Bug 1032027] btrfs cleaner => freeze
06:49 bugzilla_noreply [Bug 1114118] yast2-configuration-management build failed with yast-rake update?
06:51 bugzilla_noreply [Bug 1032849] M17N:fonts/adobe-sourcehanserif-fonts, M17N:fonts/adobe-sourcehansans-fonts: incomplete package or wrong naming
07:08 bugzilla_noreply [Bug 1084943] NetworkManager with autoconnect enabled displays error messages
07:24 bugzilla_noreply [Bug 1112853] gnome-shell under wayland high cpu utilization
07:46 bugzilla_noreply [Bug 1026191] Add BPF into llvm target for PowerPC64 and AArch64
07:48 bugzilla_noreply [Bug 1114267] with kernel-default 4.19.0-3.1, don't start X
07:49 bugzilla_noreply [Bug 993642] apache2-mod_nss fails test suite with new mozilla-nss
07:49 bugzilla_noreply [Bug 969159] subversion dependencies do not enforce matching password store (here: svn_kwallet)
07:50 bugzilla_noreply [Bug 1001971] greenbone-security-assistant fails to build
07:55 bugzilla_noreply [Bug 928328] VUL-1: libnettle: off-by-one in the test suite
08:10 bugzilla_noreply [Bug 1084943] NetworkManager with autoconnect enabled displays error messages
08:17 bugzilla_noreply [Bug 1086755] LibreOffice Calc: Copy only works every other time.
08:50 bugzilla_noreply [Bug 1112963] AST Video Kernel Mode Driver is broken
09:12 bugzilla_noreply [Bug 1113199] ipv6 is not enabled correctly on bridges
09:15 bugzilla_noreply [Bug 1114118] yast2-configuration-management build failed with yast-rake update?
09:17 bugzilla_noreply [Bug 1110412] Color Emoji support is disabled by Noto Emoji (monochrome) and DejaVu fonts
09:48 bugzilla_noreply [Bug 1114383] chkstat is not always called after Zypper has installed packages
10:00 bugzilla_noreply [Bug 1112920] [Build 20181022] openQA test fails in start_install as plasma5-desktop package not built for ppc64 (BE)
10:04 bugzilla_noreply [Bug 1114434] New: VUL-1: CVE-2018-18820: [buffer overflow in url-auth]
10:14 bugzilla_noreply [Bug 1114383] chkstat is not always called after Zypper has installed packages
10:15 bugzilla_noreply [Bug 1112920] [Build 20181022] openQA test fails in start_install as plasma5-desktop package not built for ppc64 (BE)
10:16 bugzilla_noreply [Bug 1110412] Color Emoji support is disabled by Noto Emoji (monochrome) and DejaVu fonts
10:19 bugzilla_noreply [Bug 1110412] Color Emoji support is disabled by Noto Emoji (monochrome) and DejaVu fonts
10:25 bugzilla_noreply [Bug 1114447] New: [20181101] transactional-updates: line 707: [: single: integer expression expected
10:31 bugzilla_noreply [Bug 1114383] chkstat is not always called after Zypper has installed packages
10:43 bugzilla_noreply [Bug 1112920] [Build 20181022] openQA test fails in start_install as plasma5-desktop package not built for ppc64 (BE)
10:44 bugzilla_noreply [Bug 1114455] New: [20181101] kubeadm_base installation failed
10:45 bugzilla_noreply [Bug 1114434] VUL-1: CVE-2018-18820: icecast: [buffer overflow in url-auth]
10:46 bugzilla_noreply [Bug 1114434] VUL-0: CVE-2018-18820: icecast: [buffer overflow in url-auth]
10:46 bugzilla_noreply [Bug 1114434] VUL-0: CVE-2018-18820: icecast: buffer overflow in url-auth
11:04 bugzilla_noreply [Bug 1112920] [Build 20181022] openQA test fails in start_install as plasma5-desktop package not built for ppc64 (BE)
11:22 bugzilla_noreply [Bug 1114383] chkstat is not always called after Zypper has installed packages
11:55 bugzilla_noreply [Bug 1114383] chkstat is not always called after Zypper has installed packages
12:49 bugzilla_noreply [Bug 1108134] libcdio update breaks vcdimager build
13:11 bugzilla_noreply [Bug 1114484] New: [Build 1262.1] openQA test lacks status icons for patterns
13:17 bugzilla_noreply [Bug 1107253] yast2-rmt fails in the unit test
13:18 bugzilla_noreply [Bug 1098653] updating openmpi erases mpi-selector settings
13:20 bugzilla_noreply [Bug 1109976] ImageMagick maintenance update breaks builds
13:30 bugzilla_noreply [Bug 1012389] xfce4-terminal immediately becomes zombie
13:32 bugzilla_noreply [Bug 995961] X11:xfce/xfce4-panel: 'Other' group disappears from application menu
13:33 bugzilla_noreply [Bug 995960] X11:xfce/xfdesktop: menu lacks 'Other' applications
13:37 bugzilla_noreply [Bug 1104598] /etc/crictl.yaml owned by wrong package (cri-o not cri-tools)
13:37 bugzilla_noreply [Bug 1104821] Make cri-o default for kubernetes on Kubic
13:42 bugzilla_noreply [Bug 1114383] chkstat is not always called after Zypper has installed packages
13:46 bugzilla_noreply [Bug 1112769] login.defs uid/gid values during autoyast install not respected
13:49 bugzilla_noreply [Bug 1114492] New: very high cpu when batch rename files
13:50 bugzilla_noreply [Bug 1114492] very high cpu batch rename files when file name duplicate
13:51 bugzilla_noreply [Bug 1114492] very high cpu batch rename files when file name duplicate
14:08 bugzilla_noreply [Bug 1111657] python-cffi build fail on i586 with glibc maintenance update
14:08 bugzilla_noreply [Bug 1110868] MTP doesn't work in KDE with LEAP 15.0
14:10 bugzilla_noreply [Bug 1114383] chkstat is not always called after Zypper has installed packages
14:10 bugzilla_noreply [Bug 1111427] Cloud:Tools:Next/cloud-init: Bug cloud.cfg isn't parsed correctly
14:16 bugzilla_noreply [Bug 1099340] cloud-init-config-suse defaults to ubuntu
14:20 bugzilla_noreply [Bug 1057496] devel:languages:python/python-six: egg-info can't be unpacked, cpio rename
14:20 bugzilla_noreply [Bug 1084765] kubeternetes-kubeadm seems to be missing dependencies
14:23 bugzilla_noreply [Bug 1114492] very high cpu( desktop hang ) batch rename files when file name duplicate
14:24 bugzilla_noreply [Bug 1114492] very high cpu batch rename files when file name duplicate
14:24 bugzilla_noreply [Bug 1114502] wpa_supplicant start before network.target and ignored Link section in systemd-networkd config
14:24 bugzilla_noreply [Bug 1114502] New: wpa_supplicant start before network.target and ignored Link section in systemd-networkd config
14:25 bugzilla_noreply [Bug 1097388] cloud-init running before network online
14:27 bugzilla_noreply [Bug 1055834] [FAILED] Failed to start Setup Virtual Console.
14:31 bugzilla_noreply [Bug 1114160] static network configuration using BOOTPROTO=none
14:31 bugzilla_noreply [Bug 998301] noto-sans-cjk-fonts changes fonts family preference for sans-serif, mono, and serif
14:39 bugzilla_noreply [Bug 1114434] VUL-0: CVE-2018-18820: icecast: buffer overflow in url-auth
14:40 bugzilla_noreply [Bug 1114492] very high cpu( desktop hang ) batch rename files when file name duplicate
14:43 bugzilla_noreply [Bug 1108981] jack: fix return value check of mmap()
14:48 bugzilla_noreply [Bug 1114385] raspberry pi 3: leap 15 kernel freeze when multiple /dev/ttyUSBx devices get opened
14:55 bugzilla_noreply [Bug 1114385] raspberry pi 3: leap 15 kernel freeze when multiple /dev/ttyUSBx devices get opened
15:00 bugzilla_noreply [Bug 1112963] AST Video Kernel Mode Driver is broken
15:16 bugzilla_noreply [Bug 1112963] AST Video Kernel Mode Driver is broken
15:17 bugzilla_noreply [Bug 1114385] raspberry pi 3: leap 15 kernel freeze when multiple /dev/ttyUSBx devices get opened
15:35 bugzilla_noreply [Bug 1110426] The machine is halted at the end of Autoyast stage 2 while a reboot is requested
15:42 bugzilla_noreply [Bug 1114519] New: VUL-0: CVE-2018-3977:SDL2_image: XCF image can cause a heap overflow, resulting in code execution
15:48 bugzilla_noreply [Bug 1112464] after 20181015 and kernel 4.18.13-1-default nouveau fails to start secondary screen on Nvidia quadro
15:50 bugzilla_noreply [Bug 1114519] VUL-0: CVE-2018-3977: SDL_image,SDL2_image: XCF image can cause a heap overflow, resulting in code execution
15:53 bugzilla_noreply [Bug 1114523] New: please add the aacraid driver to the default kernel config on ppc64le
15:55 bugzilla_noreply [Bug 1114523] please add the aacraid driver to the default kernel config on ppc64le
16:02 bugzilla_noreply [Bug 1114160] static network configuration using BOOTPROTO=none
16:02 bugzilla_noreply [Bug 1114434] VUL-0: CVE-2018-18820: icecast: buffer overflow in url-auth
16:04 bugzilla_noreply [Bug 1114523] please add the aacraid driver to the default kernel config on ppc64le
16:09 bugzilla_noreply [Bug 1114523] please add the aacraid driver to the default kernel config on ppc64le
16:12 bugzilla_noreply [Bug 1114523] please add the aacraid driver to the default kernel config on ppc64le
16:33 bugzilla_noreply [Bug 1114447] [20181101] transactional-updates: line 707: [: single: integer expression expected
16:33 bugzilla_noreply [Bug 1109044] spice-server package gives performance issues to Windows 10 KVM guests
16:33 bugzilla_noreply [Bug 1099991] GTK has a broken implementation of the decoration protocol on wayland
16:34 bugzilla_noreply [Bug 1043125] Internal error at opening "Add System Extensions or Modules" if Software manager opened
17:01 bugzilla_noreply [Bug 1112963] AST Video Kernel Mode Driver is broken
17:09 bugzilla_noreply [Bug 1109044] spice-server package gives performance issues to Windows 10 KVM guests
17:09 bugzilla_noreply [Bug 1043125] Internal error at opening "Add System Extensions or Modules" if Software manager opened
17:16 bugzilla_noreply [Bug 1114447] [20181101] transactional-updates: line 707: [: single: integer expression expected
17:23 bugzilla_noreply [Bug 1114537] New: Exec and TryExec of Gimp's /usr/share/applications/gimp.desktop should be gimp
17:34 bugzilla_noreply [Bug 1114538] New: systemd: journalctl performance is slower compared to Leap 42.3
17:35 bugzilla_noreply [Bug 1114538] systemd: journalctl performance is slower compared to Leap 42.3
17:38 bugzilla_noreply [Bug 1114523] please add the aacraid driver to the default kernel config on ppc64le
18:11 bugzilla_noreply [Bug 1105181] [Build 20180815] font in xterm is way bigger than before due to https://build.opensuse.org/package/rdiff/openSUSE:Factory/xterm?linkrev=base&rev=110
18:12 bugzilla_noreply [Bug 1114382] "Optional update to add gcc8" is incomplete
18:12 bugzilla_noreply [Bug 1114383] chkstat is not always called after Zypper has installed packages
18:13 bugzilla_noreply [Bug 1105181] [Build 20180815] font in xterm is way bigger than before due to https://build.opensuse.org/package/rdiff/openSUSE:Factory/xterm?linkrev=base&rev=110
18:30 bugzilla_noreply [Bug 1112817] Firefox 63 requires rust >= 1.28
18:30 bugzilla_noreply [Bug 1105181] [Build 20180815] font in xterm is way bigger than before due to https://build.opensuse.org/package/rdiff/openSUSE:Factory/xterm?linkrev=base&rev=110
18:33 bugzilla_noreply [Bug 1114383] chkstat is not always called after Zypper has installed packages
18:35 bugzilla_noreply [Bug 1108672] VUL-0: CVE-2018-17088: jhead: Integer overflow in gpsinfo.c while running jhead
18:58 bugzilla_noreply [Bug 1114382] "Optional update to add gcc8" is incomplete
19:47 bugzilla_noreply [Bug 1112920] [Build 20181022] openQA test fails in start_install as plasma5-desktop package not built for ppc64 (BE)
20:08 bugzilla_noreply [Bug 1108630] VUL-0: CVE-2018-17096: soundtouch: remote denial of service (assertion failure and application exit) in the BPMDetect class in BPMDetect.cpp
20:08 bugzilla_noreply [Bug 1108631] VUL-0: CVE-2018-17097: soundtouch: remote denial of service (double free) in the WavFileBase class in WavFile.cpp
20:09 bugzilla_noreply [Bug 1108632] VUL-0: CVE-2018-17098: soundtouch: remote denial of service (heap corruption from size inconsistency) in the WavFileBase class in WavFile.cpp
20:12 bugzilla_noreply [Bug 1108630] VUL-0: CVE-2018-17096: soundtouch: remote denial of service (assertion failure and application exit) in the BPMDetect class in BPMDetect.cpp
20:12 bugzilla_noreply [Bug 1108631] VUL-0: CVE-2018-17097: soundtouch: remote denial of service (double free) in the WavFileBase class in WavFile.cpp
20:12 bugzilla_noreply [Bug 1108632] VUL-0: CVE-2018-17098: soundtouch: remote denial of service (heap corruption from size inconsistency) in the WavFileBase class in WavFile.cpp
20:28 bugzilla_noreply [Bug 1112920] [Build 20181022] openQA test fails in start_install as plasma5-desktop package not built for ppc64 (BE)
21:41 bugzilla_noreply [Bug 1114383] chkstat is not always called after Zypper has installed packages
22:20 bugzilla_noreply [Bug 1101393] Suspend/Resumes shows desktop content before loading a lockscreen with potential privacy concerns
23:09 bugzilla_noreply [Bug 1057900] traceroute needs to have enabled in it's AppArmor profile RO access to files in /proc/sys/net/ipv4/
23:10 bugzilla_noreply [Bug 1080244] conflict of liberation-fonts and liberation2-fonts
23:13 bugzilla_noreply [Bug 1114434] VUL-0: CVE-2018-18820: icecast: buffer overflow in url-auth

03 November, 2018

04:15 bugzilla_noreply [Bug 1113894] [Staging] Virtualbox fails to build against puthon 3.7
05:34 bugzilla_noreply [Bug 1092737] [Build 20180508] openQA test fails in hexchat - Wrong visualization for special characters and numbers.
06:31 bugzilla_noreply [Bug 1092737] [Build 20180508] openQA test fails in hexchat - Wrong visualization for special characters and numbers.
07:40 bugzilla_noreply [Bug 1112097] VUL-0: virtualbox: October 2018 release, multiple vulnerabilities
07:40 bugzilla_noreply [Bug 1113894] [Staging] Virtualbox fails to build against puthon 3.7
07:42 bugzilla_noreply [Bug 879402] date format of atq is unusable for sorting
07:42 bugzilla_noreply [Bug 1074247] python-urllib3: fails test suite starting with 31.12.2017
07:42 bugzilla_noreply [Bug 1057900] traceroute needs to have enabled in it's AppArmor profile RO access to files in /proc/sys/net/ipv4/
07:44 bugzilla_noreply [Bug 1099991] GTK has a broken implementation of the decoration protocol on wayland
08:03 bugzilla_noreply [Bug 1055834] [FAILED] Failed to start Setup Virtual Console.
09:10 bugzilla_noreply [Bug 1112464] after 20181015 and kernel 4.18.13-1-default nouveau fails to start secondary screen on Nvidia quadro
09:45 bugzilla_noreply [Bug 1114566] New: Warnings during kernel build
09:53 bugzilla_noreply [Bug 1114566] Warnings during kernel build
09:54 bugzilla_noreply [Bug 1114566] Warnings during kernel build
09:55 bugzilla_noreply [Bug 1114566] Warnings during kernel build
09:57 bugzilla_noreply [Bug 1114566] Warnings during kernel build
09:57 bugzilla_noreply [Bug 1114566] Warnings during kernel build
10:00 bugzilla_noreply [Bug 1114566] Warnings during kernel build
10:02 bugzilla_noreply [Bug 1114566] Warnings during kernel build
12:13 bugzilla_noreply [Bug 1112464] after 20181015 and kernel 4.18.13-1-default nouveau fails to start secondary screen on Nvidia quadro
12:14 bugzilla_noreply [Bug 1112464] after 20181015 and kernel 4.18.13-1-default nouveau fails to start secondary screen on Nvidia quadro
12:43 bugzilla_noreply [Bug 1114567] New: ceph-volume: memoryview: a bytes-like object is required, not 'str'
13:49 bugzilla_noreply [Bug 1107777] Can't connect to wifi network after suspend (not always)
14:20 bugzilla_noreply [Bug 1114568] New: Brightness slider don't working on GNOME with 1060 6GB GPU.
14:29 bugzilla_noreply [Bug 900558] Impossible to boot in single user mode with root mounted read only
15:14 bugzilla_noreply [Bug 1114569] New: Need to delete /etc/resolv.conf when connecting to Wifi with specific DNS
15:17 bugzilla_noreply [Bug 1114570] New: Digital clock widget dislplays wrong local time
15:18 bugzilla_noreply [Bug 1114570] Digital clock widget dislplays wrong local time
15:40 bugzilla_noreply [Bug 1103682] global applications shortcuts flaky
15:59 bugzilla_noreply [Bug 1114566] Warnings during kernel build
16:42 bugzilla_noreply [Bug 1114571] New: python-textX not reproducible
16:47 bugzilla_noreply [Bug 1114251] NVIDIA driver components have different versions
16:49 bugzilla_noreply [Bug 1114251] NVIDIA driver components have different versions
16:50 bugzilla_noreply [Bug 1114251] NVIDIA driver components have different versions
17:04 bugzilla_noreply [Bug 1114569] Need to delete /etc/resolv.conf when connecting to Wifi with specific DNS
17:08 bugzilla_noreply [Bug 1114569] Need to delete /etc/resolv.conf when connecting to Wifi with specific DNS
17:19 bugzilla_noreply [Bug 1114569] Need to delete /etc/resolv.conf when connecting to Wifi with specific DNS
17:40 bugzilla_noreply [Bug 1103682] global applications shortcuts flaky
18:03 bugzilla_noreply [Bug 1114573] New: Expand libyui to support setting YImage from icon theme
< Previous 1 | 2 | 3 | 4 | 5 | 6 | 7 | 8 | 9 | 10 | 11 | 12 | 13 | 14 | 15 | 16 Next >
List Navigation