Mailinglist Archive: opensuse-bugs (4661 mails)

by author

< Previous 1 | 2 | 3 | 4 | 5 | 6 | 7 | 8 | 9 | 10 | 11 | 12 | 13 | 14 | 15 | 16 | 17 | 18 | 19 Next >

bugzilla_noreply

22 Jun [Bug 1030236] [META] GCC 7 package failures
21 Jun [Bug 1045158] libvirt doesn't start virtual machines if apparmor is enabled
14 Jun [Bug 1043757] Bugfix-Release for GNU Health/Tryton
14 Jun [Bug 1042850] Package calibre requires python-Pygments >= 2.0.1, but this requirement cannot be provided
12 Jun [Bug 1043815] No RAND_egd() available from openssl required by mailx
12 Jun [Bug 1042764] Xserver: Sig11 after Reset and following Xclient terminates
07 Jun [Bug 980495] ICE on Leap 42.2 with gcc 4.8
23 Jun [Bug 1045180] role selection dialog tuning via control.xml
12 Jun [Bug 1043653] Sensitivity/pressure data untweakable on Microsoft Precision touchpad on Dell XPS 13
15 Jun [Bug 1044521] suse-xsl-stylesheets update problem switching from liberation-fonts to liberation2-fonts dependency
19 Jun [Bug 1043122] yast2-registration package installed by upgrade to openSUSE 42.3beta
23 Jun [Bug 1037891] All YaST module window names show "ruby" instead of a more specifc name (was: Yast module windows in Plasma: generic x window icon and grouped as "ruby" in task manager)
12 Jun [Bug 1043389] [Build 0271] openQA test fails in kdump yast module with "core dumped" when finishing
13 Jun [Bug 1042919] provide curl-mini
28 Jun [Bug 1045185] gnome-shell SIGSEGV libGLdispatch.so.0 for ppc64le TW snapshot 20170619
07 Jun [Bug 1037891] All YaST module window names show "ruby" instead of a more specifc name (was: Yast module windows in Plasma: generic x window icon and grouped as "ruby" in task manager)
28 Jun [Bug 1030873] [Build 20170322] role-based desktop selection lxde does not autologin
23 Jun [Bug 1041248] GCC 7: kde3-basket fails to build
23 Jun [Bug 1045780] plug in jack headphones two times causing session interruption
28 Jun [Bug 1046333] Kstars don't have localization/translation files
20 Jun [Bug 1045045] zypper ref fails with misleading "Cannot write file" message
23 Jun [Bug 1045310] Archiving/unrar: security issue: VMSF_DELTA memory corruption
23 Jun [Bug 1041219] GCC 7: ldmtool fails to build
05 Jun [Bug 1042551] os-prober + KVM on host kills btrfs in clients
02 Jun [Bug 1041130] Konversation crashing regularly with segfaults
22 Jun [Bug 1042933] kernel panic due to nmi caused by systemd-watchdog test
19 Jun [Bug 1044980] New: krunner Segmentation Fault after ppc64le guest install and reboot
29 Jun [Bug 1046679] Apache fails to start, if cobbler package installed
26 Jun [Bug 980890] The select words could be cleared while use ibus-pinyin in Firefox
21 Jun [Bug 1043218] YaST crashes on installation of banshee
14 Jun [Bug 1044061] nextcloud-client outdated; version from network repo doesn't build locally
08 Jun [Bug 1043270] yast2-live-installer in Leap 42.2 crash right after copying into hard disk
07 Jun [Bug 1042996] random flickering on AMD RX480
01 Jun [Bug 1042040] Education/OpenBoard: Needs to link to the Qt5 version of quazip
02 Jun [Bug 1042496] the ftp nVidia driver link broken
15 Jun [Bug 997641] Unable to mount root on boot
08 Jun [Bug 1031500] debug kernel log spam with battery events
08 Jun [Bug 987184] CryptLVM installation does not work on new install if the HDD contains old LVM setup
17 Jun [Bug 1042760] Added CMake files to AqBanking and Gwenhywfar
16 Jun [Bug 1044690] VUL-0: chromium: multiple vulnerabilities fixed in 59.0.3071.104
29 Jun [Bug 1046586] New: 42.3 installation keyboard layout defaults to traditional Chinese instead of french
23 Jun [Bug 1030236] [META] GCC 7 package failures
28 Jun [Bug 1046431] Intel Skylake and Kaby lake hyperthreading bug
20 Jun [Bug 1044900] [openqa] Upgrade from 12.3 has issues around libmodplug.so.1
01 Jun [Bug 1031295] Desktop Selection: Other should install enhanced base pattern by default.
06 Jun [Bug 1042658] libqt5-qtbase fails to build with openssl-1.1
05 Jun [Bug 1037210] yast2-pkg-bindings download of source packages would crash
16 Jun [Bug 1044777] Clicking on the Change Log tab when viewing kernel-devel caused Yast to freeze up the desktop
03 Jun [Bug 1042542] KDE NetworkManager client cannot set MTU for wired interface
14 Jun [Bug 1042919] provide curl-mini
28 Jun [Bug 1045886] ecryptfs problems with recent Tumbleweed
27 Jun [Bug 1045340] regression: java segfaults on latest kernels caused by the stack gap fix
28 Jun [Bug 1029982] [Tumbleweed 20170316] Kernel Oops on attempting to return from locked screen on gnome-session
29 Jun [Bug 1046584] btrfs (?) issue: no space left on device
15 Jun [Bug 770608] [yast2-metapackage-handler] 1-click install shows success, but package not installed
07 Jun [Bug 1024551] coreutils: install: install -D -t fails
28 Jun [Bug 1046311] bnc#1039354, CVE-2017-1000365: openSUSE-42.2 is missing
19 Jun [Bug 1044838] New: latest update broke remmina-plugin-rdp
13 Jun [Bug 1044030] [Trackerbug] Version update for astyle
06 Jun [Bug 927677] some usb sticks require root password to mount
08 Jun [Bug 944866] smbstatus machine column doesn't resolve hostname and show ip
08 Jun [Bug 1043269] Kiwi boot image description for'isoboot/suse-leap42.2' does not exist
27 Jun [Bug 1046129] GnuCash reports fail when using version 2.6.7
15 Jun [Bug 1043449] xfsaild sometimes prevents suspend
27 Jun [Bug 1046157] postgresql96 duplicates binaries to be introduced via maintenance update
19 Jun [Bug 1041497] [Build 20170527] apache2 fails to start
29 Jun [Bug 1046261] NET build stuck at downloading initrd
15 Jun [Bug 1043103] repetition of optional kernel parameters on update
25 Jun [Bug 1045899] New: cyrus-imapd-2.4.19-145.1.i586.rpm in http://download.opensuse.org/repositories/server:/mail. lmtpunix segaults.
21 Jun [Bug 1037533] Latest kpartx (0.6.2+suse20170412.35e16a42-2.4.1) fails to delete partition mappings
13 Jun [Bug 1044030] [Trackerbug] Version update for astyle
12 Jun [Bug 1018262] Installation failure "cpio: rename" PowerPC multipath openQA test
29 Jun [Bug 1046500] Plasma shell crashes every time the panel is removed from the plasma desktop
10 Jun [Bug 1043070] multimedia:apps/shotcut: Bug
29 Jun [Bug 1046623] debootstrap-1.0.72 misses Xenial support
08 Jun [Bug 1043270] yast2-live-installer in Leap 42.2 crash right after copying into hard disk
09 Jun [Bug 1037234] Gnome Control Center reports wrong disk size
05 Jun [Bug 998850] Kernel slab eats all memory
20 Jun [Bug 1045045] New: zypper ref fails with misleading "Cannot write file" message
21 Jun [Bug 1045158] libvirt doesn't start virtual machines if apparmor is enabled
23 Jun [Bug 1031424] hwinfo: error while loading shared libraries: libhd.so.20
29 Jun [Bug 910900] Espeak-gui does not use selected language to speech
19 Jun [Bug 1044873] New: Problem: nothing provides typelib(Gdk) needed by gramps-4.2.5-77.6.noarch
13 Jun [Bug 1044087] vagrant 'package' command results in backtrace: cannot load such file -- /usr/share/vagrant/lib/vagrant/action/general/package (LoadError)
03 Jun [Bug 809337] wrong version of keepassx in security:passwordmanagement repo
06 Jun [Bug 1042873] Artifacts with HD530 and modesetting driver
02 Jun [Bug 1040086] When setting up a brand new account IMAP in kmai5/kontakt it is impossible to modify it or to create another one.
13 Jun [Bug 1044046] New: openSUSE Leap 42.3 can't update package
12 Jun [Bug 1043794] gwenview shows "Color space: Uncalibrated" for AdobeRGB images
26 Jun [Bug 1041275] GCC 7: python-celery fails to build
26 Jun [Bug 1034402] Kwin crashes due to bug in QtDeclarative
06 Jun [Bug 1042228] rtorrent crashes on startup
07 Jun [Bug 1042717] [4.12-rc] very slow network via virtio_net
14 Jun [Bug 1038324] YaST segfaults upon "Abort" with 1 GB RAM
19 Jun [Bug 1044863] kexec-bootloader: Initrd section empty with grub2 bootloader
06 Jun [Bug 1039476] AUDIT-0: bluetooth dongle does not work when automatically enabled
23 Jun [Bug 1031424] hwinfo: error while loading shared libraries: libhd.so.20
12 Jun [Bug 1019076] Add 'Python' to 'Component' section for filing bug-reports on 'python-*' modules
20 Jun [Bug 1036171] btrfs soft lockup kernel 4.10.9-1 ppc64le
23 Jun [Bug 1030236] [META] GCC 7 package failures
09 Jun [Bug 1043604] desktop icons in SLE classic are abnormally big + redundant entry Home.desktop shown
15 Jun [Bug 1044046] openSUSE Leap 42.3 can't update package
22 Jun [Bug 1037795] ReiserFS module crashes but contunies
29 Jun [Bug 1046652] Update of spec-cleaner to release 0.9.8
19 Jun [Bug 1044995] libical crashes while parsing timezones
15 Jun [Bug 1044375] Qualcomm Atheros QCA6174 802.11ac Wireless Network Adapter will not load firmware
14 Jun [Bug 1044070] Leap-42.3-Build0275 installer requests manually select core packages
14 Jun [Bug 1040616] Printing/ghostscript-fonts: Bug "Digest verification failed" ... wrong pkg chksums
13 Jun [Bug 1044046] openSUSE Leap 42.3 can't update package
19 Jun [Bug 1044777] Clicking on the Change Log tab in Yast2 Software Management while viewing kernel-devel causes Yast2 Software Management to freeze
07 Jun [Bug 1042900] can't install Mesa-libd3d-32bit
07 Jun [Bug 1043119] New: rsyslogd core dumps after switch to GCC7 during boot
21 Jun [Bug 851473] Unable to install on IBM Netfinity server
07 Jun [Bug 1042037] Apache upgrade runs /usr/share/apache2/apache-22-24-upgrade and issues a2enmod: command not found
29 Jun [Bug 1046277] TUMBLEWEED texlive is broken in tumbleweed 20170626
26 Jun [Bug 1045936] kdepim4 maintenance update conflicts in kjots and akonadi/kdepim-addons
28 Jun [Bug 1042717] [4.12-rc] very slow network via virtio_net
14 Jun [Bug 1044223] openvpn does not start (/run/openvpn/ is not created)
19 Jun [Bug 1044657] In the rescue system, some symlinks have been converted into plain regular files
23 Jun [Bug 1031424] hwinfo: error while loading shared libraries: libhd.so.20
30 Jun [Bug 1042933] kernel panic due to nmi caused by systemd-watchdog test
14 Jun [Bug 1044223] New: openvpn does not start (/run/openvpn/ is not created)
02 Jun [Bug 1029042] Hardware Error with instant shutdown
06 Jun [Bug 1042833] New: VUL-0: Chromium 59.0.3071.86 stable security bump
02 Jun [Bug 1042082] Add support for new AppArmor rule types
02 Jun [Bug 1042433] New: GRUB_DISABLE_LINUX_RECOVERY vs GRUB_DISABLE_RECOVERY
17 Jun [Bug 1017461] btrfs balance renders system unresponsive and eventually even kills WiFi when quota is enabled
15 Jun [Bug 1044436] openSUSE package search via Firefox search bar points to wrong url
26 Jun [Bug 1045914] New: Using plasma5 and booting into a saved session konsole doesn't start if session saved with now nonexistent usb drive.
28 Jun [Bug 1046311] New: bnc#1039354, CVE-2017-1000365: openSUSE-42.2 is missing
01 Jun [Bug 1039818] lyx crashed with global menu enabled
09 Jun [Bug 1042559] yast2-live-installer does not work in openSUSE 42.3
23 Jun [Bug 1045181] On Yast partition tool, manually reordered storage devices’ column titles' order is not saved.
17 Jun [Bug 1044521] suse-xsl-stylesheets update problem switching from liberation-fonts to liberation2-fonts dependency
23 Jun [Bug 1041184] GCC 7: aegisub fails to build
01 Jun [Bug 1042212] susehelp is scheduled for removal
07 Jun [Bug 1043040] New: [lvm test] read-ahead.sh failed
29 Jun [Bug 1028372] VUL-0: CVE-2017-2636: kernel-source: local privilege escalation flaw in n_hdlc
22 Jun [Bug 1030873] [Build 20170322] role-based desktop selection lxde does not autologin
06 Jun [Bug 1042850] Package calibre requires python-Pygments >= 2.0.1, but this requirement cannot be provided
23 Jun [Bug 1045713] New: Upgrading legacy mode system with EFI mode stick breaks the system
07 Jun [Bug 1042037] Apache upgrade runs /usr/share/apache2/apache-22-24-upgrade and issues a2enmod: command not found
02 Jun [Bug 1041742] Filetriggers do not fire (reliably)
12 Jun [Bug 1030891] Split off ibdiagui from ibutils
14 Jun [Bug 1042664] net-snmp fails to build with openssl-1.1
17 Jun [Bug 1000501] [KDE Plasma5] Sound is unstable (tested in VirtualBox)
02 Jun [Bug 1042082] Add support for new AppArmor rule types
26 Jun [Bug 1041220] GCC 7: lcms fails to build
28 Jun [Bug 1046431] New: Intel Skylake and Kaby lake hyperthreading bug
19 Jun [Bug 1037234] Gnome Control Center reports wrong disk size
27 Jun [Bug 1020283] No password prompt for LUKS-cryptsetup shown after upgrade of systemd
05 Jun [Bug 1042629] [TRACKERBUG] openssl 1.1 build failures
29 Jun [Bug 1043590] gcc7: test for %suse_version 1330
29 Jun [Bug 1046664] external monitor not usable on tumbleweed
24 Jun [Bug 1041222] GCC 7: kscope fails to build
02 Jun [Bug 1042372] dpdk uses gcc6 to compile
29 Jun [Bug 1006806] Dell 5510 with WD15 Docking station - speaker port not working
10 Jun [Bug 1043653] Sensitivity/pressure data untweakable on Microsoft Precision touchpad on Dell XPS 13
15 Jun [Bug 1044447] Downgrade from TW fails with package conflicts
29 Jun [Bug 1046330] pandoc-pdf cannot be installed because of missing require
30 Jun [Bug 938657] /usr/lib/systemd/system/saslauthd.service is broken
12 Jun [Bug 1042658] libqt5-qtbase fails to build with openssl-1.1
08 Jun [Bug 1043414] New: umount hangs on ppc64le -> reduced build power on OBS
28 Jun [Bug 1040022] CPU fan speed not being reported
21 Jun [Bug 1045340] groupwise segfaults on kernel-default-4.4.72-18.12.2 (regression from stack gap fix?)
12 Jun [Bug 1043602] systemd fstrim timer defaults is insanely long
13 Jun [Bug 1044114] New: libzypp-plugin-appdata uses outdated appstreamcli command
17 Jun [Bug 1044521] suse-xsl-stylesheets update problem switching from liberation-fonts to liberation2-fonts dependency
23 Jun [Bug 1037236] config:type="boolean" not allowed on some elements of <global>
24 Jun [Bug 1031328] libkleo fails to build with GCC 7
03 Jun [Bug 1042528] New: security/keepassx: Segfault for search
23 Jun [Bug 1045694] Leap 42.3 No Wifi after install - Intel Dual Band Wireless-AC 8260
25 Jun [Bug 1045700] Leap 42.3 - systemd-coredump loads every CPU core
28 Jun [Bug 1046333] Kstars don't have localization/translation files
03 Jun [Bug 1038368] Any interaction with zypper says the Desktop is going to be removed, but it never is
06 Jun [Bug 1042916] tmpfiles cups.conf unknown group sys
28 Jun [Bug 1046261] NET build stuck at downloading initrd
06 Jun [Bug 1042919] provide curl-mini
29 Jun [Bug 1046277] TUMBLEWEED texlive is broken in tumbleweed 20170626
02 Jun [Bug 944866] smbstatus machine column doesn't resolve hostname and show ip
13 Jun [Bug 1033781] YaST registration page got provided for openSUSE TW
01 Jun [Bug 1040463] Oops in i915 driver function gen6_ppgtt_insert_entries
10 Jun [Bug 1043467] Hangs on boot with latest (4.4.70-18) kernel
14 Jun [Bug 1042660] libssh2_org fails to build with openssl-1.1
30 Jun [Bug 1017461] btrfs balance renders system unresponsive and eventually even kills WiFi when quota is enabled
12 Jun [Bug 1043770] bazaar broken by python update
15 Jun [Bug 1044447] New: Downgrade from TW fails with package conflicts
25 Jun [Bug 1045898] KDE 5.8.7 User PATH
16 Jun [Bug 1044727] New: screen resolution off-by-2 on Raspberry Pi 3: 1922x1200
15 Jun [Bug 1044483] [Build 20170613] LXQt fails to peform system shutdown
22 Jun [Bug 1045483] New: Installing plasma-discover should install packagekit
12 Jun [Bug 1043043] [lvm test] lvchange-cache.sh failed with error "Manual repair required!"
13 Jun [Bug 1044045] FIrewall: crash when I add an application rule from empty list.
05 Jun [Bug 1036679] %{suseversion} in about dialog
23 Jun [Bug 1044777] YaST2 Qt Software Manager unresponsive for minutes when loading kernel change log
15 Jun [Bug 1044483] New: [Build 20170613] LXQt fails to peform system shutdown
24 Jun [Bug 1030236] [META] GCC 7 package failures
14 Jun [Bug 1036463] Please take over /usr/lib/modules-load.d/sg.conf
04 Jun [Bug 1040463] Oops in i915 driver function gen6_ppgtt_insert_entries
22 Jun [Bug 1045553] New: ncurses version of yast2 is started instead of qt/gtk
13 Jun [Bug 952712] Gnome Boxes : Unable to start domain: internal error: process exited while connecting to monitor: spice-qemu-char: unsupported type: smartcard
19 Jun [Bug 1044521] suse-xsl-stylesheets update problem switching from liberation-fonts to liberation2-fonts dependency
14 Jun [Bug 1044045] FIrewall: crash when I add an application rule from empty list.
02 Jun [Bug 1042496] the ftp nVidia driver link broken
13 Jun [Bug 980890] The select words could be cleared while use ibus-pinyin in Firefox
12 Jun [Bug 1043758] machinectl pull-tar segfaults in tar_pull_job_on_finished
23 Jun [Bug 1045754] New: Problem with YAST2-NETWORK
29 Jun [Bug 1046584] New: btrfs (?) issue: no space left on device
28 Jun [Bug 1046269] initrd is really slow to load at system boot
06 Jun [Bug 1042850] Package calibre requires python-Pygments >= 2.0.1, but this requirement cannot be provided
29 Jun [Bug 1046277] TUMBLEWEED texlive is broken in tumbleweed 20170626
23 Jun [Bug 1041279] GCC 7: physfs fails to build
06 Jun [Bug 916027] build-compare: openmpi contains hostname
14 Jun [Bug 1042675] thrift fails to build with openssl-1.1
28 Jun [Bug 1040951] samba-krb-printing unable to get kerberos ticket
01 Jun [Bug 1042134] New: vlc-3.0.0 can't play BluRays
12 Jun [Bug 1042738] pdns cannot be installed
07 Jun [Bug 1043186] Leap 42.2 does not support Intel Dual Band Wireless AC(2x2) 8265
06 Jun [Bug 1042760] Added CMake files to AqBanking and Gwenhywfar
07 Jun [Bug 1041122] systemd-journal-remote missing from openSUSE 42.3
02 Jun [Bug 1037731] MaxRequestWorkers instead of MaxClients in server-tuning.conf
17 Jun [Bug 1044813] New: missing libvulkan_*-32bit im Mesa package
13 Jun [Bug 1042664] net-snmp fails to build with openssl-1.1
05 Jun [Bug 1041124] plasmashell exit with exit code 13
23 Jun [Bug 1043785] Machinery not installable (since rubygem-haml has been updated)
30 Jun [Bug 1042637] Dump fails to build with openssl-1.1
12 Jun [Bug 1041122] systemd-journal-remote missing from openSUSE 42.3
23 Jun [Bug 1045658] yast2 services-manager is very slow after 3.1.44 update
22 Jun [Bug 1045484] libgltf-0_0-0 package found in orphaned packages will remove all of libreoffice
27 Jun [Bug 1045889] csh.cshrc: cwdcmd alias should not be set when $HOME/.csh.expert is readable
29 Jun [Bug 1046608] vim does not honor global vimrc
19 Jun [Bug 1044777] Clicking on the Change Log tab in Yast2 Software Management while viewing kernel-devel caused desktop to freeze
26 Jun [Bug 1045886] ecryptfs problems with recent Tumbleweed
07 Jun [Bug 1042012] Latest gcc 7-1.2 cause crash
08 Jun [Bug 1013561] dell 7470 - keyboard backlight states work well but throws error
28 Jun [Bug 1006420] No signal on HDMI output after upgrade to kernel 4.8.3-1
19 Jun [Bug 1042536] [Build 0118] Recurring console error message on bootup "mmc0: Unknown controller version (3). You may experience problems"
01 Jun [Bug 974661] wicked resets host name after wickedd restart
23 Jun [Bug 1041247] GCC 7: kde3-kaffeine fails to build
17 Jun [Bug 1044809] New: Kaby Lake Lenovo x270 no sound with Ultra Dock Headphone Jack
08 Jun [Bug 1043422] New: firefox doesn't quit after close ( gcc7? ) libpcsclite
13 Jun [Bug 1044105] python3-vobject / PyICU broken
04 Jun [Bug 1041209] GCC 7: glade3 fails to build
07 Jun [Bug 1043115] "net usershare list" only usable by root
16 Jun [Bug 875528] [libyui] sax3-monitor sometimes segfaults after exiting with Cancel
25 Jun [Bug 1045896] New: xboxdrv does not generate mouse events
25 Jun [Bug 1045521] Unknown services fail restart during installation via zypper
14 Jun [Bug 1042629] [TRACKERBUG] openssl 1.1 build failures
17 Jun [Bug 1044762] M-Audio Audiophile 2496
09 Jun [Bug 1041966] A new Build cycle involving java-1_7_0-openjdk-bootstrap has appeard
< Previous 1 | 2 | 3 | 4 | 5 | 6 | 7 | 8 | 9 | 10 | 11 | 12 | 13 | 14 | 15 | 16 | 17 | 18 | 19 Next >
List Navigation