Mailinglist Archive: opensuse-bugs (4661 mails)

by author

< Previous 1 | 2 | 3 | 4 | 5 | 6 | 7 | 8 | 9 | 10 | 11 | 12 | 13 | 14 | 15 | 16 | 17 | 18 | 19 Next >

bugzilla_noreply

14 Jun [Bug 1042629] [TRACKERBUG] openssl 1.1 build failures
29 Jun [Bug 1046696] New: The libjpeg62-32Bit-Library is not offered in 42.3, but can be found in Tumbleweed
29 Jun [Bug 1046724] New: Qt5WebKit crashes on JS string operations
02 Jun [Bug 899013] mobile router R215 from vodafone not switched because of outdated usb_modeswitch database
12 Jun [Bug 997757] fstrim takes almost an hour, starves other IO-bound processes
28 Jun [Bug 1045891] kernel 4.11.7+Ryzen(nouveau driver): USB device mount failing (perhaps in connection with IRQ 7 trap)
16 Jun [Bug 1044521] suse-xsl-stylesheets update problem switching from liberation-fonts to liberation2-fonts dependency
02 Jun [Bug 1042295] [4.12-rc] trace_printk() being used. Allocating extra memory.
19 Jun [Bug 1043449] xfsaild sometimes prevents suspend
29 Jun [Bug 1046579] New: libusnic_verbs-rdmav2 failed to build with rdma-core 14
19 Jun [Bug 1007551] emacs: considered out of date for Spacemacs and other packages
01 Jun [Bug 1040463] Oops in i915 driver function gen6_ppgtt_insert_entries
22 Jun [Bug 1045396] [Build 20170620] openQA test fails in network_configuration - network.service is unknown
22 Jun [Bug 1041889] Solver testcase lacks some resolver options
18 Jun [Bug 1044690] VUL-0: chromium: multiple vulnerabilities fixed in 59.0.3071.104
26 Jun [Bug 980890] The select words could be cleared while use ibus-pinyin in Firefox
20 Jun [Bug 946325] Firewall blocks nfs mounts though nfs-server is listed among the accepted services
14 Jun [Bug 1044294] FCoE, BUG: sleeping function called from invalid context at ../kernel/locking/mutex.c:97, QEMU, x86_64
16 Jun [Bug 1042550] [Build 20170602] openQA test fails in java - Java 9 not installable
13 Jun [Bug 1034478] Mouse driver
27 Jun [Bug 1046158] New: [kmp, psign, obs] Building KMPs without # needssslcertforbuild leads to broken Signatures
14 Jun [Bug 1041076] [Build 0066][ppc64le] grub shows "openSUSE-Kubic" instead of "openSUSE Leap 42.3 Alpha" (regression)
13 Jun [Bug 1043391] gcc segfaults while compiling samba on aarch64
28 Jun [Bug 1046277] TUMBLEWEED texlive is broken in tumbleweed 20170626
12 Jun [Bug 1043868] Secondary language issues
21 Jun [Bug 1031424] hwinfo: error while loading shared libraries: libhd.so.20
12 Jun [Bug 1018262] Installation failure "cpio: rename" PowerPC multipath openQA test
20 Jun [Bug 959641] When installing on UEFI, yast proposes /boot partition unnecessarily for LVM+Encryption proposal.
14 Jun [Bug 841822] FOSS AMD video driver gives black screen on resume from Suspend
09 Jun [Bug 1039737] Kernel BUG at ../mm/huge_memory.c / split_huge_page
19 Jun [Bug 1043912] kernel 4.4.70-18.9-default is unable to mount some btrfs partitions, unlike previous kernel
23 Jun [Bug 1044114] libzypp-plugin-appdata uses outdated appstreamcli command
20 Jun [Bug 1043591] kernel: do not require gcc-devel for SLE/Leap
22 Jun [Bug 1045180] role selection dialog tuning via control.xml
27 Jun [Bug 1046104] Monospaced font SourceCodePro is bold by default after update to texlive 2017
26 Jun [Bug 1045553] ncurses version of yast2 is started instead of qt/gtk
28 Jun [Bug 1046277] TUMBLEWEED texlive is broken in tumbleweed 20170626
11 Jun [Bug 1043653] Sensitivity/pressure data untweakable on Microsoft Precision touchpad on Dell XPS 13
13 Jun [Bug 1033691] [lvm2 test] factory LVM has many test failures
14 Jun [Bug 1043446] AutoYaST does not open ssh port in SuSEfirewall2 on first boot
28 Jun [Bug 1045375] Unable to connect to wifi because password can not be accepted within LXDE, LXQt, XFCE, …
30 Jun [Bug 1046174] OpenIPMIpthread .pc file is broken on SLE
13 Jun [Bug 1042856] [Build 0267] openQA test fails in snapper_cleanup: btrfs_qgroup_account_extents
25 Jun [Bug 1011158] Intel Broxton: vdpau via libvdpau-va-gl+vaapi not working
22 Jun [Bug 1041281] GCC 7: ode fails to build
25 Jun [Bug 1045896] xboxdrv does not generate mouse events
06 Jun [Bug 1041161] Release of liberasurecode{1,-devel} for Leap 42.2
12 Jun [Bug 1043560] tcsh login fails
01 Jun [Bug 1041811] GNOME Internet Radio Locator 10.0.0 is available
06 Jun [Bug 876389] ARM lacks support for zImage
05 Jun [Bug 1042726] New: virtualbox is missing support for building kernel modules
10 Jun [Bug 1043606] text selected in unfocussed gtk dialogues is hardly readable, white on very light grey
30 Jun [Bug 1046409] Gnome or Gnome classical GDM logon doesn't work after upgrade from 42.2 to current 42.3
12 Jun [Bug 1043962] New: Pound proxy service file fails with "cgroup: fork rejected by pids controller"
24 Jun [Bug 1045598] Docker on btrfs failing due to 'no space left on device' despite a lot of free space
29 Jun [Bug 938657] /usr/lib/systemd/system/saslauthd.service is broken
09 Jun [Bug 1043502] Error "NameError: global name 'getopt' is not defined" in Mercurial after applying Leap 42.2 Update-Test patch 6851 ("Security update for mercurial", brings Mercurial version from 3.8.3-1.5 to 3.8.3-2.3.1)
13 Jun [Bug 1043734] Applications (such as Kopete, Clementine, Keepassx, Amarok) segfault when using ibus rather than XIM for input method.
03 Jun [Bug 1042534] New: [Build 20170529] openQA test fails in gnuhealth_install -> "nothing provides python2-pycha"
13 Jun [Bug 1043706] slideshow.pot for Leap 42.3
12 Jun [Bug 1042764] Xserver: Sig11 after Reset and following Xclient terminates
10 Jun [Bug 1041290] GCC 7: mgetty fails to build
01 Jun [Bug 1041742] Filetriggers do not fire (reliably)
16 Jun [Bug 1022082] SEGV (11) on /usr/bin/file-roller
08 Jun [Bug 1043465] yast2-storage must require partitioning tools
14 Jun [Bug 1042629] [TRACKERBUG] openssl 1.1 build failures
02 Jun [Bug 1041469] llvm4 spec issues
29 Jun [Bug 1037210] yast2-pkg-bindings download of source packages would crash
07 Jun [Bug 1043122] yast2-registration package installed by upgrade to openSUSE 42.3beta
02 Jun [Bug 1041911] Wlogical-not-parentheses warning always happen during ibus-pinyin compiling.
03 Jun [Bug 1031500] debug kernel log spam with battery events
05 Jun [Bug 1042629] [TRACKERBUG] openssl 1.1 build failures
22 Jun [Bug 1028136] initrd is really slow to load at system boot
06 Jun [Bug 1042764] Xvfb: Sig11 after Xserver reset and following Xclient terminates
15 Jun [Bug 1044436] openSUSE package search via Firefox search bar points to wrong url
03 Jun [Bug 1041159] FUSE not functional due to wrong fusermount permissions
28 Jun [Bug 1046320] New: [Build 20170623] openQA test fails in gnucash due to unfocused desktop-runner
12 Jun [Bug 1043228] yast2-live-installer does not work in openSUSE 42.2
01 Jun [Bug 1041829] [Build 20170516] yast2_ftp fails with "UI Syntax Error" - "Invalid Arguments for the Label widgets"
08 Jun [Bug 1043270] New: yast2-live-installer crash right after copying into hard disk
12 Jun [Bug 1043591] kernel: do not require gcc-devel for SLE/Leap
15 Jun [Bug 1044409] New: Yast2 installation error, the drive hd0 is defined multiple times in the device map
04 Jun [Bug 1038368] Any interaction with zypper says the Desktop is going to be removed, but it never is
09 Jun [Bug 1043543] evince: "In pixman_region32_init_rect: Invalid rectangle passed" and other
07 Jun [Bug 1043231] Kernel build failed at armv7hl
27 Jun [Bug 1046197] rsync 3.1.2 breaks backward compatibility with older versions
08 Jun [Bug 1043422] firefox doesn't quit after close ( gcc7? ) libpcsclite
19 Jun [Bug 1044649] aarch64: internal compiler error: Illegal instruction
13 Jun [Bug 1043969] New: elantech touchpad stopped working
22 Jun [Bug 1045569] Scroll bars are missing the ability to move a single line using on-screen arrow buttons
16 Jun [Bug 1044777] New: Clicking on the Change Log tab when viewing kernel-devel cause yast to freeze up the desktop
22 Jun [Bug 1017267] zypper exception: Can't delete '/etc/zypp/repos.d/_tmpRPMcache_.repo'
09 Jun [Bug 1029975] sash has binaries in /bin
13 Jun [Bug 1008832] Missing zh_CN translation on installer slideshows
27 Jun [Bug 1035640] No keyboard or mouse input at KDE login screen
23 Jun [Bug 1045848] SeaMonkey doesn't display WebGL properly
01 Jun [Bug 1027742] virtualbox cannot setup host-only network parameters
08 Jun [Bug 1040709] nothing provides png++-devel
29 Jun [Bug 1046576] New: [lvm test] fsadm.sh and lvresize-full.sh failed because of wrong path for fsadm
12 Jun [Bug 990325] fsck at boot times out, preventing boot
12 Jun [Bug 1043543] evince: "In pixman_region32_init_rect: Invalid rectangle passed" and other
05 Jun [Bug 1042672] New: Ruby 2.2 and 2.3 fail to build with openssl-1.1
13 Jun [Bug 1043602] systemd fstrim timer defaults is insanely long
16 Jun [Bug 1044705] Failed to mount openSUSE ISO: Unable to verify that the media was mounted
15 Jun [Bug 1044436] openSUSE package search via Firefox search bar points to wrong url
06 Jun [Bug 1042916] New: tmpfiles cups.conf unknown group sys
07 Jun [Bug 1039163] gstreamer is Unable to play MPEG-1 or MPEG-2 video files on nVidia gpu
13 Jun [Bug 976796] Virt-manager does not show up in application menu
06 Jun [Bug 983472] cpanm can't install Parse::PMFile : Can't locate Parse/PMFile.pm
28 Jun [Bug 1046458] konsole freezes for many seconds during bash tab completion when run remotely
07 Jun [Bug 983161] Segmentation fault on build of quantlib
01 Jun [Bug 1039700] [Build 0243] hanging system within plasma session
16 Jun [Bug 1042933] kernel panic due to nmi caused by systemd-watchdog test
26 Jun [Bug 1045654] Umbrello desktop file references wrong binary
05 Jun [Bug 1042629] [TRACKERBUG] openssl 1.1 build failures
22 Jun [Bug 1030873] [Build 20170322] role-based desktop selection lxde does not autologin
26 Jun [Bug 1045920] Cinnamon 3.4 Lock screen not working after latest update
08 Jun [Bug 1035887] S-BOX doesn't work properly on Broadwell
08 Jun [Bug 1043338] New: spelling error in packages-i18n-libqt - entry 40
26 Jun [Bug 1041850] Kmail crashes on startup validating sieve scripts
25 Jun [Bug 1045884] Snapper section of the Reference guide should mention the default mounted subvolume
16 Jun [Bug 1044386] EULA in Chinese does not have ideal line breaker.
20 Jun [Bug 1044087] vagrant 'package' command results in backtrace: cannot load such file -- /usr/share/vagrant/lib/vagrant/action/general/package (LoadError)
16 Jun [Bug 1044646] Missing libclc dependency in Mesa-libOpenCL
02 Jun [Bug 1040169] libglvnd does not replace libglvnd0
07 Jun [Bug 1043228] yast2-live-installer does not work in openSUSE 42.2
28 Jun [Bug 1040951] samba-krb-printing unable to get kerberos ticket
12 Jun [Bug 1030210] VUL-0: PAM grants network access through NM without or/and with the wrong root password
22 Jun [Bug 1045484] libgltf-0_0-0 package found in orphaned packages will remove all of libreoffice
22 Jun [Bug 1028136] initrd is really slow to load at system boot
20 Jun [Bug 1044816] kernel 4.4.71 doesn't allow user to install Nvidia blob with nvidia-drm feature enabled
02 Jun [Bug 1002699] xfs_fsr segfault
08 Jun [Bug 990325] fsck at boot times out, preventing boot
02 Jun [Bug 1041122] systemd-journal-remote missing from openSUSE 42.3
14 Jun [Bug 1028408] "cat /mnt/etc/os-release" gives wrong value on a mounted system
27 Jun [Bug 1046213] New: GDM not displaying user accounts until restart
28 Jun [Bug 1046197] rsync 3.1.2 breaks backward compatibility with older versions
27 Jun [Bug 1039469] kiwi: Image built with 'oem-partition-install' can`t find partitions
06 Jun [Bug 1042772] xload crashes
09 Jun [Bug 1039737] Kernel BUG at ../mm/huge_memory.c / split_huge_page
24 Jun [Bug 1041183] GCC 7: Rivet fails to build
22 Jun [Bug 1045631] Broadcom wifi not recognised with build 0283
26 Jun [Bug 1041268] GCC 7: scim fails to build
12 Jun [Bug 1039249] update tslib package
21 Jun [Bug 1045340] groupwise segfaults on kernel-default-4.4.72-18.12.2 (regression from stack gap fix?)
23 Jun [Bug 1045834] ipsec doesn't route TCP with 4.11 kernel
26 Jun [Bug 1043912] kernel 4.4.70-18.9-default is unable to mount some btrfs partitions, unlike previous kernel
28 Jun [Bug 1044815] An affirmation proves to be erroneous regarding the boot partition on RAID and leads to abort installations.
08 Jun [Bug 1043408] does not recognize sourceforge tickets
06 Jun [Bug 959641] When installing on UEFI, yast proposes /boot partition unnecessarily for LVM+Encryption proposal.
26 Jun [Bug 1045935] can not create DLM resource with hawk
27 Jun [Bug 1031248] [Build 0138] '[' appearing on screen unmotivated
15 Jun [Bug 1044433] Subprocess failed. Error: RPM failed: error unpacking of archive failed on file cpio: rename failed-No space left on devic
07 Jun [Bug 1043125] New: Internal error at opening "Add System Extensions or Modules" if Software manager opened
06 Jun [Bug 1042559] yast2-live-installer not works since openSUSE 42.2 - please remove package from 42.3
30 Jun [Bug 1046174] OpenIPMIpthread .pc file is broken on SLE
07 Jun [Bug 970773] gem_install.sh selects wrong gem version
20 Jun [Bug 1045124] Changes for manual NVIDIA driver installation
19 Jun [Bug 1044014] ordering problems for user creation
13 Jun [Bug 1043912] kernel 4.4.70-18.9-default is unable to mount some btrfs partitions, unlike previous kernel
13 Jun [Bug 1043566] Application:Geo/qgis: Bug
19 Jun [Bug 1044803] Default online repositories not used even if installing with network connection by default
24 Jun [Bug 1030236] [META] GCC 7 package failures
26 Jun [Bug 1045920] New: Cinnamon 3.4 Lock screen not working after latest update
14 Jun [Bug 981878] Very weak sound after installing LEAP 42,1
30 Jun [Bug 1046571] Virtualbox guest kmp broken on 32 bit Tumbleweed - gcc7 issue
22 Jun [Bug 1041889] Solver testcase lacks some resolver options
27 Jun [Bug 1046104] Monospaced font SourceCodePro is bold by default after update to texlive 2017
25 Jun [Bug 1045340] regression: java segfaults on latest kernels caused by the stack gap fix
05 Jun [Bug 1042629] [TRACKERBUG] openssl 1.1 build failures
27 Jun [Bug 1031424] hwinfo: error while loading shared libraries: libhd.so.20
07 Jun [Bug 1042877] zypper digest verification failed for file 'go-1.8.3-1.1.x86_64.rpm'
16 Jun [Bug 1041220] GCC 7: lcms fails to build
29 Jun [Bug 1046623] debootstrap-1.0.72 misses Xenial support
26 Jun [Bug 1045898] User PATH doesn't work
25 Jun [Bug 1045886] ecryptfs problems with recent Tumbleweed
28 Jun [Bug 1043653] Sensitivity/pressure data untweakable on Microsoft Precision touchpad on Dell XPS 13
28 Jun [Bug 968826] tumbleweed/leap installation leads into kernel panic
09 Jun [Bug 1043514] New: Kgpg exports secret key and revokekey without asking for password from kgpg
19 Jun [Bug 1044888] New: Traceback on certificat validation failure in Python
09 Jun [Bug 1043533] New: No usb functionality at the LUKS password input screen when using a notebook with external usb keyboard and mouse
24 Jun [Bug 1045880] New: Keyboard layout defaults to US
09 Jun [Bug 1043467] Hangs on boot with latest (4.4.70-18) kernel
23 Jun [Bug 1030236] [META] GCC 7 package failures
26 Jun [Bug 1025985] X-server reliably crashing from userspace
28 Jun [Bug 1046309] New: Popup title is not hidden in installation
13 Jun [Bug 1043115] "net usershare list" only usable by root
16 Jun [Bug 1044521] suse-xsl-stylesheets update problem switching from liberation-fonts to liberation2-fonts dependency
02 Jun [Bug 1030236] [META] GCC 7 package failures
17 Jun [Bug 1044816] kernel 4.4.71 doesn't allow user to install Nvidia blob with nvidia-drm feature enabled
15 Jun [Bug 1042131] bootloader grub2-efi not useable after upgarde from 13.2 -> 42.2
06 Jun [Bug 1042856] [Build 0267] openQA test fails in snapper_cleanup: Btrfs-related kernel BUG
07 Jun [Bug 1043231] Kernel build failed at armv7hl
01 Jun [Bug 1042090] TW 20170529 major breakage in Thunderbird
28 Jun [Bug 1046197] rsync 3.1.2 breaks backward compatibility with older versions
07 Jun [Bug 1028575] System randomly freezes or crashes to the login screen, glitches until rebooted
27 Jun [Bug 1046099] duplicate binaries in openSUSE:Leap:42.3
13 Jun [Bug 987846] VUL-0: CVE-2016-6160: tcpreplay: segfault upon huge frames, missing size check
28 Jun [Bug 1030873] [Build 20170322] role-based desktop selection lxde does not autologin
15 Jun [Bug 1044409] Yast2 installation error, the drive hd0 is defined multiple times in the device map
08 Jun [Bug 1043418] chromium: empty patch fix-gn-bootstrap.diff
01 Jun [Bug 1041121] ALSA mixer fails to open for sound card
29 Jun [Bug 1046680] New: Realtek 8187 wireless adapter will only connect via Network manager: Wicked does not configure adapter
05 Jun [Bug 1042629] [TRACKERBUG] openssl 1.1 build failures
14 Jun [Bug 913058] GNU tar doesn't cooperate well with Amanda anymore
22 Jun [Bug 1045259] Kernel Panic 4.4.71
01 Jun [Bug 1042216] At installation, display is extended to second monitor instead of mirrored
01 Jun [Bug 1040042] Tumbleweed: Install KVM with yast2 fails
08 Jun [Bug 1043267] New: Atom editor fileselector no longer works
22 Jun [Bug 1002699] xfs_fsr segfault
09 Jun [Bug 981083] rpm ksyms fileattrs do not expand %name
14 Jun [Bug 1000501] [KDE Plasma5] Sound is unstable (tested in VirtualBox)
14 Jun [Bug 1044046] openSUSE Leap 42.3 can't update package
02 Jun [Bug 1031890] GStreamer regression, multifilesink writes no longer atomic
28 Jun [Bug 1045892] YaST Hypervisor and tools module fails to install KVM
10 Jun [Bug 1043741] Leap 42.3 Build 0272 (2017-06-08) showed as Alpha, but should be RC
16 Jun [Bug 1044777] Clicking on the Change Log tab when viewing kernel-devel caused Yast to freeze up the desktop
09 Jun [Bug 1027742] virtualbox cannot setup host-only network parameters
12 Jun [Bug 1043734] Certain applications segfault when using ibus rather than XIM for input method.
07 Jun [Bug 1042845] stty failure breaks start_shell
02 Jun [Bug 1011815] [Build 20161121] Console messages writes over YaST configuration page in terminal
26 Jun [Bug 975866] Scanner no longer detected by sane/scanimage
14 Jun [Bug 1044224] New: ksmserver: autostart service ("/usr/bin/plasmashell") finished with exit code 13
06 Jun [Bug 1042559] yast2-live-installer not works since openSUSE 42.2 - please remove package from 42.3
07 Jun [Bug 1043043] [lvm] lvchange-cache.sh failed with error "Manual repair required!"
22 Jun [Bug 1045340] regression: java segfaults on latest kernels caused by the stack gap fix
02 Jun [Bug 1042082] Add support for new AppArmor rule types
27 Jun [Bug 1046104] Monospaced font SourceCodePro is bold by default after update to texlive 2017
28 Jun [Bug 1042933] kernel panic due to nmi caused by systemd-watchdog test
22 Jun [Bug 1037210] yast2-pkg-bindings download of source packages would crash
07 Jun [Bug 1042877] zypper digest verification failed for file 'go-1.8.3-1.1.x86_64.rpm'
08 Jun [Bug 1043280] Tumbleweed Kernel 4.11 Won't Boot Lenovo Thinkpad T510
19 Jun [Bug 1044705] Failed to mount openSUSE ISO: Unable to verify that the media was mounted
19 Jun [Bug 1044948] file conflict between libOpenCL1 and nvidia-computeG03
26 Jun [Bug 1045901] New: strongswan 5.3.5: No connection possible!
26 Jun [Bug 1045944] New: JeOS OpenStack image fails to start - systemd-firstboot seems to be executed instead of cloud-init
14 Jun [Bug 1042629] [TRACKERBUG] openssl 1.1 build failures
28 Jun [Bug 1012142] SEGV (11) on plymouthd
23 Jun [Bug 1041274] GCC 7: python-fixtures fails to build
08 Jun [Bug 1043462] gns3 broken packages
25 Jun [Bug 1045886] New: ecryptfs problems with recent Tumbleweed
01 Jun [Bug 1042040] Education/OpenBoard: Needs to link to the Qt5 version of quazip
23 Jun [Bug 1045848] New: SeaMonkey doesn't display WebGL properly
05 Jun [Bug 1042629] New: [TRACKERBUG] openssl 1.1 build failures
28 Jun [Bug 1043912] kernel 4.4.70-18.9-default is unable to mount some btrfs partitions, unlike previous kernel
29 Jun [Bug 1046584] btrfs (?) issue: no space left on device
19 Jun [Bug 1044987] Kubic still unable to boot
17 Jun [Bug 1043757] Bugfix-Release for GNU Health/Tryton
16 Jun [Bug 1032733] Improve the usability of User Logon Management
09 Jun [Bug 1042638] fedfs-utils fails to build with openssl-1.1
< Previous 1 | 2 | 3 | 4 | 5 | 6 | 7 | 8 | 9 | 10 | 11 | 12 | 13 | 14 | 15 | 16 | 17 | 18 | 19 Next >
List Navigation