Mailinglist Archive: opensuse-bugs (4258 mails)

< Previous Next >
[Bug 1022687] libqt5-qtimageformats no longer compiled agains libjasper dependency
  • From: bugzilla_noreply@xxxxxxxxxx
  • Date: Tue, 31 Jan 2017 06:49:44 +0000
  • Message-id: <bug-1022687-21960-wazDv5Wy5P@http.bugzilla.opensuse.org/>
http://bugzilla.opensuse.org/show_bug.cgi?id=1022687
http://bugzilla.opensuse.org/show_bug.cgi?id=1022687#c1

Hrvoje Senjan <hrvoje.senjan@xxxxxxxxx> changed:

What |Removed |Added
----------------------------------------------------------------------------
CC| |hrvoje.senjan@xxxxxxxxx

--- Comment #1 from Hrvoje Senjan <hrvoje.senjan@xxxxxxxxx> ---
g++ -c -pipe -O2 -std=gnu++11 -fno-exceptions -Wall -W -fPIC
-DQT_NO_EXCEPTIONS -D_LARGEFILE64_SOURCE -D_LARGEFILE_SOURCE
-I/home/hrvoje/Src/qtimageformats-opensource-src-5.8.0/config.tests/jasper
-I. -isystem /usr/include/pgsql/ -isystem /usr/include/pgsql/server -isystem
/usr/include/mysql -I/usr/lib64/qt5/mkspecs/linux-g++ -o .obj/jasper.o
/home/hrvoje/Src/qtimageformats-opensource-src-5.8.0/config.tests/jasper/jasper.cpp
In file included from /usr/include/jasper/jasper.h:65:0,
from
/home/hrvoje/Src/qtimageformats-opensource-src-5.8.0/config.tests/jasper/jasper.cpp:31:
/usr/include/sys/types.h:150:27: error: duplicate ‘unsigned’
typedef unsigned long int ulong;
^
/usr/include/sys/types.h:150:27: error: declaration does not declare anything
[-fpermissive]
typedef unsigned long int ulong;
^
/usr/include/sys/types.h:151:28: error: duplicate ‘unsigned’
typedef unsigned short int ushort;
^
/usr/include/sys/types.h:151:28: error: duplicate ‘short’
typedef unsigned short int ushort;
^
/usr/include/sys/types.h:151:28: error: declaration does not declare anything
[-fpermissive]
/usr/include/sys/types.h:152:22: error: duplicate ‘unsigned’
typedef unsigned int uint;
^
/usr/include/sys/types.h:152:22: error: multiple types in one declaration
typedef unsigned int uint;
^
/usr/include/sys/types.h:152:22: error: declaration does not declare anything
[-fpermissive]
Makefile:417: recipe for target '.obj/jasper.o' failed
make: *** [.obj/jasper.o] Error 1

--
You are receiving this mail because:
You are on the CC list for the bug.
< Previous Next >
References