Mailinglist Archive: opensuse-bugs (3354 mails)

by date

< Previous 1 | 2 | 3 | 4 | 5 | 6 | 7 | 8 | 9 | 10 | 11 | 12 | 13 | 14 Next >

06 May, 2016

09:36 bugzilla_noreply [Bug 954482] package util-linux-systemd file /usr/lib/systemd/system/fstrim.timer uses feature unknown to systemd-210
09:54 bugzilla_noreply [Bug 978262] X-Server dont open tcp Port 6000 for remote use
10:06 bugzilla_noreply [Bug 978593] EFI fails to load up the grub2 image erroring out on snapshot path
10:08 bugzilla_noreply [Bug 978811] New: Desktop freeze after closing Steam
10:09 bugzilla_noreply [Bug 978593] EFI fails to load up the grub2 image erroring out on snapshot path
10:15 bugzilla_noreply [Bug 978703] Possibly bash-completion bug for systemd
10:16 bugzilla_noreply [Bug 872430] systemctl enable pure-ftpd.service does not start pure-ftp service
10:19 bugzilla_noreply [Bug 872430] systemctl enable pure-ftpd.service does not start pure-ftp service
10:31 bugzilla_noreply [Bug 978245] Can't start LibreOffice tools
10:33 bugzilla_noreply [Bug 872430] systemctl enable pure-ftpd.service does not start pure-ftp service
10:36 bugzilla_noreply [Bug 978216] WLAN crashes or fail with no possibility to reconnect again
10:39 bugzilla_noreply [Bug 978593] EFI fails to load up the grub2 image erroring out on snapshot path
10:42 bugzilla_noreply [Bug 978274] Please upgrade latex2e to above LaTeX2e <2015/01/01> patch level 2
10:47 bugzilla_noreply [Bug 975924] Qrosspython has been failing to build for > 60 days
10:49 bugzilla_noreply [Bug 978593] EFI fails to load up the grub2 image erroring out on snapshot path
10:53 bugzilla_noreply [Bug 974230] bluetooth headset a2dp hsp/hsf bad implementation
10:53 bugzilla_noreply [Bug 978593] EFI fails to load up the grub2 image erroring out on snapshot path
10:58 bugzilla_noreply [Bug 967375] yast fails to find existing partitions
10:59 bugzilla_noreply [Bug 872430] systemctl enable pure-ftpd.service does not start pure-ftp service
11:01 bugzilla_noreply [Bug 978593] EFI fails to load up the grub2 image erroring out on snapshot path
11:04 bugzilla_noreply [Bug 978274] Please upgrade latex2e to above LaTeX2e <2015/01/01> patch level 2
11:08 bugzilla_noreply [Bug 782060] ntpq is very slow
11:09 bugzilla_noreply [Bug 978833] New: systemsmanagement:saltstack/salt broken pkgrepo.managed priority atribute
11:09 bugzilla_noreply [Bug 936327] ntpd runtime configuration ("start-ntp addserver 192.168.200.1") not working
11:09 bugzilla_noreply [Bug 807186] Gnome NetworkManager nm-applet does not start openvpn connections
11:10 bugzilla_noreply [Bug 900817] NetworkManager: can't read old config file
11:11 bugzilla_noreply [Bug 962318] NTP client doesn`t work in "synchronize without daemon" mode
11:12 bugzilla_noreply [Bug 978833] systemsmanagement:saltstack/salt broken pkgrepo.managed priority atribute
11:12 bugzilla_noreply [Bug 978216] WLAN crashes or fail with no possibility to reconnect again
11:13 bugzilla_noreply [Bug 911620] svn server (svnserve) cannot be started via yast > service manager - Systemd EnvironmentFile is missing
11:13 bugzilla_noreply [Bug 977910] mount -alt nfs,nfs4 mounts filesystems with noauto set
11:13 bugzilla_noreply [Bug 969159] subversion dependencies do not enforce matching password store (here: svn_kwallet)
11:15 bugzilla_noreply [Bug 978833] systemsmanagement:saltstack/salt broken pkgrepo.managed priority atribute
11:18 bugzilla_noreply [Bug 978593] EFI fails to load up the grub2 image erroring out on snapshot path
11:21 bugzilla_noreply [Bug 977930] NetManager script for Privoxy restart
11:33 bugzilla_noreply [Bug 977946] dnscrypt-proxy :missing files and modules:Not able to change local address
11:37 bugzilla_noreply [Bug 978593] EFI fails to load up the grub2 image erroring out on snapshot path
12:07 bugzilla_noreply [Bug 978593] EFI fails to load up the grub2 image erroring out on snapshot path
12:10 bugzilla_noreply [Bug 978459] security/clamav: Update request
12:19 bugzilla_noreply [Bug 955968] drbd - fail to build drbd against kernel 4.4
12:19 bugzilla_noreply [Bug 950477] [drbd] - drbd-kmp build failure with master[4.2] and stable kernels[4.3]
12:21 bugzilla_noreply [Bug 978593] EFI fails to load up the grub2 image erroring out on snapshot path
12:31 bugzilla_noreply [Bug 978593] EFI fails to load up the grub2 image erroring out on snapshot path
12:37 bugzilla_noreply [Bug 978593] EFI fails to load up the grub2 image erroring out on snapshot path
12:42 bugzilla_noreply [Bug 978593] EFI fails to load up the grub2 image erroring out on snapshot path
13:45 bugzilla_noreply [Bug 977945] [openQA] 20160428 fails to install dualboot with Windows
14:18 bugzilla_noreply [Bug 966645] ceph-resource-agents missing in update repo
14:21 bugzilla_noreply [Bug 977910] mount -alt nfs,nfs4 mounts filesystems with noauto set
14:25 bugzilla_noreply [Bug 978593] EFI fails to load up the grub2 image erroring out on snapshot path
14:33 bugzilla_noreply [Bug 978274] Please upgrade latex2e to above LaTeX2e <2015/01/01> patch level 2
14:42 bugzilla_noreply [Bug 978865] New: SLES 12 SP 1 guest cannot detect any connected display
14:51 bugzilla_noreply [Bug 978868] New: SLES 11 SP4 guest does not show mouse cursor, and cursor position is way off
14:54 bugzilla_noreply [Bug 973756] Network is not working in OpenSuse Tumbleweed Aarch64 for Gigabyte MP30-AR0 (APM X-Gene 1)
15:13 bugzilla_noreply [Bug 978543] apache should start after remote-fs (nfs mounts)
16:00 bugzilla_noreply [Bug 915846] Unable to connect to repositories
16:33 bugzilla_noreply [Bug 978262] X-Server dont open tcp Port 6000 for remote use
16:42 bugzilla_noreply [Bug 978892] New: yast2-ntp-client: useless Config: Interval of the Synchronization in Minutes
17:11 bugzilla_noreply [Bug 978746] server:database/sqlitebrowser: Broken deps
17:24 bugzilla_noreply [Bug 978262] X-Server dont open tcp Port 6000 for remote use
18:05 bugzilla_noreply [Bug 978785] KDE desktop crashes with qxl driver warning
18:19 bugzilla_noreply [Bug 966645] ceph-resource-agents missing in update repo
19:56 bugzilla_noreply [Bug 974230] bluetooth headset a2dp hsp/hsf bad implementation
20:01 bugzilla_noreply [Bug 912170] Boot fails with BTRFS RAID1 array as /home - open ctree failed
20:11 bugzilla_noreply [Bug 977328] virtualbox guest init script requires missing config file
20:43 bugzilla_noreply [Bug 978920] New: Evolution mishandles recurring meetings
20:44 bugzilla_noreply [Bug 978920] Evolution mishandles recurring meetings
21:24 bugzilla_noreply [Bug 978459] security/clamav: Update request
21:26 bugzilla_noreply [Bug 964344] Leap 42.1 darktable 1.6.8 crashes when exporting Casio JPGs
21:40 bugzilla_noreply [Bug 971827] Screen Brightness not Changing after last Kernel Update
21:47 bugzilla_noreply [Bug 938510] NetworkManager in KDE5 asks for root password after upgrade from 13.2 to Tumbleweed
22:00 bugzilla_noreply [Bug 978262] X-Server dont open tcp Port 6000 for remote use
22:30 bugzilla_noreply [Bug 978935] New: Dolphin can't set file/directory permission bits

07 May, 2016

06:39 bugzilla_noreply [Bug 978262] X-Server dont open tcp Port 6000 for remote use
07:00 bugzilla_noreply [Bug 978262] X-Server dont open tcp Port 6000 for remote use
07:02 bugzilla_noreply [Bug 978785] KDE desktop crashes with qxl driver warning
07:10 bugzilla_noreply [Bug 978262] X-Server dont open tcp Port 6000 for remote use
07:19 bugzilla_noreply [Bug 978785] KDE desktop crashes with qxl driver warning
07:28 bugzilla_noreply [Bug 978262] X-Server dont open tcp Port 6000 for remote use
07:39 bugzilla_noreply [Bug 978785] KDE desktop crashes with qxl driver warning
07:39 bugzilla_noreply [Bug 978262] [DM] X-Server dont open tcp Port 6000 for remote use
07:40 bugzilla_noreply [Bug 978785] KDE desktop crashes with qxl driver warning
07:43 bugzilla_noreply [Bug 978785] KDE desktop crashes with qxl driver warning
07:50 bugzilla_noreply [Bug 978950] New: MySQL PHP does not respect socket settings
07:58 bugzilla_noreply [Bug 978785] KDE desktop crashes with qxl driver warning
08:06 bugzilla_noreply [Bug 978785] KDE desktop crashes with qxl driver warning
08:51 bugzilla_noreply [Bug 975911] qsapecng fails to build for > 100 days
09:05 bugzilla_noreply [Bug 978951] New: build: failed to build on armv7l
09:07 bugzilla_noreply [Bug 976813] third party scanner driver "epkowa" does no longer work with openSUSE 13.2 on a particular computer
10:06 bugzilla_noreply [Bug 978952] New: home:ecsos/MediathekView: Bug
10:11 bugzilla_noreply [Bug 969159] subversion dependencies do not enforce matching password store (here: svn_kwallet)
10:11 bugzilla_noreply [Bug 977424] "svn: E120190: Error running context: An error occurred during authentication" when accessing subversion repositories
10:12 bugzilla_noreply [Bug 911620] svn server (svnserve) cannot be started via yast > service manager - Systemd EnvironmentFile is missing
12:27 bugzilla_noreply [Bug 978170] VUL-0: CVE-2016-4478, CVE-2014-9773: atheme: security fixes
12:48 bugzilla_noreply [Bug 977941] deleting stored passswords without warning
13:08 bugzilla_noreply [Bug 911620] svn server (svnserve) cannot be started via yast > service manager - Systemd EnvironmentFile is missing
13:08 bugzilla_noreply [Bug 969159] subversion dependencies do not enforce matching password store (here: svn_kwallet)
13:09 bugzilla_noreply [Bug 977424] "svn: E120190: Error running context: An error occurred during authentication" when accessing subversion repositories
14:11 bugzilla_noreply [Bug 978262] [DM] X-Server dont open tcp Port 6000 for remote use
14:11 bugzilla_noreply [Bug 978170] VUL-0: CVE-2016-4478, CVE-2014-9773: atheme: security fixes
14:32 bugzilla_noreply [Bug 978950] MySQL PHP does not respect socket settings
15:14 bugzilla_noreply [Bug 978953] New: Kernel 4.5: Boot fails due to ACPI errors: No handler or method for GPE 0x
15:17 bugzilla_noreply [Bug 978954] New: xv video scaling doesn't work on Skylake
15:59 bugzilla_noreply [Bug 978952] home:ecsos/MediathekView: Bug
17:28 bugzilla_noreply [Bug 978955] New: "KService: No such file or directory", but kservice-devel is installed
17:37 bugzilla_noreply [Bug 978955] "KService: No such file or directory", but kservice-devel is installed
18:04 bugzilla_noreply [Bug 978289] Update to gnome-keyring causes extremely long Gnome startup delay
18:05 bugzilla_noreply [Bug 978289] Update to Leap causes extremely long delay in startup of Gnome and related desktops
18:44 bugzilla_noreply [Bug 978956] New: gvfs broken
18:46 bugzilla_noreply [Bug 978956] gvfs broken
18:56 bugzilla_noreply [Bug 974746] [REGRESSION] lightdm blinks / flashes one time
18:58 bugzilla_noreply [Bug 974746] [REGRESSION] lightdm blinks / flashes one time
19:00 bugzilla_noreply [Bug 978957] New: Unable to unlock screen with smartcard credentials
19:03 bugzilla_noreply [Bug 977941] deleting stored passswords without warning
19:15 bugzilla_noreply [Bug 978289] Update to Leap causes extremely long delay in startup of Gnome and related desktops
19:18 bugzilla_noreply [Bug 978289] Update to Leap causes extremely long delay in startup of Gnome and related desktops
19:21 bugzilla_noreply [Bug 978958] New: Game;Shooter; is not an accepted .desktop category
19:27 bugzilla_noreply [Bug 977941] chromium update: deleting stored passswords without warning
19:32 bugzilla_noreply [Bug 978289] Update to Leap causes extremely long delay in startup of Gnome and related desktops
19:35 bugzilla_noreply [Bug 978289] Update to Leap causes extremely long delay in startup of Gnome and related desktops
19:47 bugzilla_noreply [Bug 978289] Update to Leap causes extremely long delay in startup of Gnome and related desktops
19:52 bugzilla_noreply [Bug 978289] Update to Leap causes extremely long delay in startup of Gnome and related desktops
20:08 bugzilla_noreply [Bug 978289] Update to Leap causes extremely long delay in startup of Gnome and related desktops
21:24 bugzilla_noreply [Bug 977941] chromium update: deleting stored passswords without warning
22:45 bugzilla_noreply [Bug 965121] "gummi" does not work with relative path any more
22:46 bugzilla_noreply [Bug 971868] error when launching scilab GUI just after the installation

08 May, 2016

00:07 bugzilla_noreply [Bug 978289] Update to Leap causes extremely long delay in startup of Gnome and related desktops
01:59 bugzilla_noreply [Bug 978289] Update to Leap causes extremely long delay in startup of Gnome and related desktops
01:59 bugzilla_noreply [Bug 978289] Update to Leap causes extremely long delay in startup of Gnome and related desktops
02:13 bugzilla_noreply [Bug 978289] Update to Leap causes extremely long delay in startup of Gnome and related desktops
06:07 bugzilla_noreply [Bug 978954] xv video scaling doesn't work on Skylake
08:13 bugzilla_noreply [Bug 978953] Kernel 4.5: Boot fails due to ACPI errors: No handler or method for GPE 0x
08:47 bugzilla_noreply [Bug 971767] System enter emergency mode at boot
10:39 bugzilla_noreply [Bug 977941] chromium update: deleting stored passswords without warning
10:45 bugzilla_noreply [Bug 962217] Bluetooth incomming connections is not reliable after update to kernel 4.4.0-1
11:43 bugzilla_noreply [Bug 976991] Unable to access Samba from multiple file manager.
11:49 bugzilla_noreply [Bug 973539] Inconsistent scroll-bar under gnome 3.20
13:01 bugzilla_noreply [Bug 978952] home:ecsos/MediathekView: Bug
13:08 bugzilla_noreply [Bug 977930] NetManager script for Privoxy restart
13:43 bugzilla_noreply [Bug 975875] Venezuela (America/Caracas) time zone change 2016-05-01
13:44 bugzilla_noreply [Bug 975875] Venezuela (America/Caracas) time zone change 2016-05-01
13:46 bugzilla_noreply [Bug 973570] smbd locks up the kernel
13:53 bugzilla_noreply [Bug 977930] NetManager script for Privoxy restart
13:57 bugzilla_noreply [Bug 973570] smbd locks up the kernel
13:57 bugzilla_noreply [Bug 977930] NetManager script for Privoxy restart
14:00 bugzilla_noreply [Bug 915846] Unable to connect to repositories
14:01 bugzilla_noreply [Bug 971767] System enter emergency mode at boot
14:10 bugzilla_noreply [Bug 571503] [MC] bad timestamps on files copied from legacy LANMAN shares
14:44 bugzilla_noreply [Bug 977932] Keyboard and mouse locked on resume with kernel update
15:22 bugzilla_noreply [Bug 969519] aarch64 on qemu: Can't boot after update to 4.4.2-1
16:40 bugzilla_noreply [Bug 966999] IPv6 Privacy Extensions don't work with NetworkManager
16:53 bugzilla_noreply [Bug 978956] gvfs broken
17:01 bugzilla_noreply [Bug 978954] xv video scaling doesn't work on Skylake
17:35 bugzilla_noreply [Bug 978955] "KService: No such file or directory", but kservice-devel is installed
17:37 bugzilla_noreply [Bug 976813] third party scanner driver "epkowa" does no longer work with openSUSE 13.2 on a particular computer
18:39 bugzilla_noreply [Bug 975794] zypper: bad German translation
18:51 bugzilla_noreply [Bug 976840] Shared folder does not work at Leap 42.1 as VirtualBox's guest
18:52 bugzilla_noreply [Bug 977200] [vboxdrmfb] VirtualBox Guest KMS driver does not work with xf86-video-fbdev
18:55 bugzilla_noreply [Bug 953737] Applications not showing, panel and menu gone in Virtualbox
18:59 bugzilla_noreply [Bug 976940] Display does not light up in Virtualbox
19:27 bugzilla_noreply [Bug 978954] xv video scaling doesn't work on Skylake
19:35 bugzilla_noreply [Bug 976940] Display does not light up in Virtualbox
20:21 bugzilla_noreply [Bug 978973] New: Removing vga option breaks plymouth after installing Nvidia blob and now shows three questions
20:22 bugzilla_noreply [Bug 978973] Removing vga option breaks plymouth after installing Nvidia blob and now shows three questions
20:22 bugzilla_noreply [Bug 978973] Removing vga option from Yast Bootloader breaks plymouth after installing Nvidia blob and now shows three questions
20:51 bugzilla_noreply [Bug 976940] Display does not light up in Virtualbox
20:52 bugzilla_noreply [Bug 978974] New: goa-deamon: error reading /etc/ssl/ca-bundle.pem
20:54 bugzilla_noreply [Bug 976863] zypper ps show all processes under vanilla kernel
21:01 bugzilla_noreply [Bug 978973] Removing vga option from Yast Bootloader breaks plymouth after installing Nvidia blob and now shows three questions
21:46 bugzilla_noreply [Bug 965667] segfault on bfd_elf_get_dynamic_symtab_upper_bound x86_64

09 May, 2016

00:04 bugzilla_noreply [Bug 977945] [openQA] 20160428 fails to install dualboot with Windows
00:45 bugzilla_noreply [Bug 977945] [openQA] 20160428 fails to install dualboot with Windows
02:26 bugzilla_noreply [Bug 973756] Network is not working in OpenSuse Tumbleweed Aarch64 for Gigabyte MP30-AR0 (APM X-Gene 1)
03:22 bugzilla_noreply [Bug 978958] Game;Shooter; is not an accepted .desktop category
03:51 bugzilla_noreply [Bug 978366] YaST Boot Loader doesn't allow to change default boot section
03:51 bugzilla_noreply [Bug 978366] YaST Boot Loader doesn't allow to change default boot section
05:30 bugzilla_noreply [Bug 959686] btrfs:snapper: cannot delete subvolume messed up by docker
05:56 bugzilla_noreply [Bug 977942] [GTK3] With default Plasma settings, text selection highlighting is not (clearly?) visible
05:56 bugzilla_noreply [Bug 977910] mount -alt nfs,nfs4 mounts filesystems with noauto set
05:57 bugzilla_noreply [Bug 977942] [GTK3] With default Plasma settings, text selection highlighting is not (clearly?) visible
05:57 bugzilla_noreply [Bug 977710] Switch firefox to building against gtk3 by default
05:57 bugzilla_noreply [Bug 977910] mount -alt nfs,nfs4 mounts filesystems with noauto set
06:05 bugzilla_noreply [Bug 978974] goa-deamon: error reading /etc/ssl/ca-bundle.pem
06:22 bugzilla_noreply [Bug 978991] New: Lokalize not rebuilt with new Hunspell
06:35 bugzilla_noreply [Bug 978991] Lokalize not rebuilt with new Hunspell
06:40 bugzilla_noreply [Bug 978991] Lokalize not rebuilt with new Hunspell
06:40 bugzilla_noreply [Bug 978691] YaST2 bootloader crash with undefined local variable or method 'extended'
06:40 bugzilla_noreply [Bug 978993] New: Weird device node names in cfdisk
06:42 bugzilla_noreply [Bug 978993] Weird device node names in cfdisk
06:45 bugzilla_noreply [Bug 973756] Network is not working in OpenSuse Tumbleweed Aarch64 for Gigabyte MP30-AR0 (APM X-Gene 1)
06:55 bugzilla_noreply [Bug 924519] FSRVP server state on-disk format upgrade for upstream
07:01 bugzilla_noreply [Bug 976991] Unable to access Samba from multiple file manager.
07:31 bugzilla_noreply [Bug 978974] goa-deamon: error reading /etc/ssl/ca-bundle.pem
07:35 bugzilla_noreply [Bug 970293] systemd 228: service file installation complains of missing [Install] section
07:35 bugzilla_noreply [Bug 970293] systemd 228: service file installation complains of missing [Install] section
07:56 bugzilla_noreply [Bug 978691] YaST2 bootloader crash with undefined local variable or method 'extended'
08:11 bugzilla_noreply [Bug 912903] python3-requests crashes with https
08:15 bugzilla_noreply [Bug 978892] yast2-ntp-client: useless Config: Interval of the Synchronization in Minutes
08:16 bugzilla_noreply [Bug 978892] yast2-ntp-client: useless Config: Interval of the Synchronization in Minutes
08:19 bugzilla_noreply [Bug 979007] New: Cannot introspect /org/opensuse/Network/DHCP4/Interface/2
08:29 bugzilla_noreply [Bug 978974] goa-deamon: error reading /etc/ssl/ca-bundle.pem
08:30 bugzilla_noreply [Bug 978892] yast2-ntp-client: useless Config: Interval of the Synchronization in Minutes
08:35 bugzilla_noreply [Bug 977259] Wrong location of completion file of util-linux packages
08:37 bugzilla_noreply [Bug 978974] goa-deamon: error reading /etc/ssl/ca-bundle.pem
08:37 bugzilla_noreply [Bug 978260] Virtualization:containers/docker: Bug
08:40 bugzilla_noreply [Bug 979016] New: root cannot login via GDM
08:48 bugzilla_noreply [Bug 979017] New: Gnome-session dumps core
08:48 bugzilla_noreply [Bug 978243] Internal error in yast2 lan [openQA textmode test]
08:48 bugzilla_noreply [Bug 979017] Gnome-session dumps core
08:53 bugzilla_noreply [Bug 978243] Internal error in yast2 lan [openQA textmode test]
08:55 bugzilla_noreply [Bug 978243] Internal error in yast2 lan [openQA textmode test]
08:55 bugzilla_noreply [Bug 977953] yast2 lan fails to start
08:57 bugzilla_noreply [Bug 979017] Gnome-session dumps core
09:01 bugzilla_noreply [Bug 978260] Virtualization:containers/docker: Bug
09:03 bugzilla_noreply [Bug 978260] Virtualization:containers/docker: Bug
09:08 bugzilla_noreply [Bug 978260] Virtualization:containers/docker: Bug
09:10 bugzilla_noreply [Bug 978260] Docker 1.11 requires runC and containerd binaries be called docker-*
09:13 bugzilla_noreply [Bug 979024] New: Video players fail to play videos
09:23 bugzilla_noreply [Bug 976841] bluedevil, SPP not implemented
09:23 bugzilla_noreply [Bug 979017] Gnome-session dumps core
09:23 bugzilla_noreply [Bug 979017] Gnome-session dumps core
09:24 bugzilla_noreply [Bug 979017] Gnome-session dumps core
09:24 bugzilla_noreply [Bug 978958] Game;Shooter; is not an accepted .desktop category
09:29 bugzilla_noreply [Bug 973756] Network is not working in OpenSuse Tumbleweed Aarch64 for Gigabyte MP30-AR0 (APM X-Gene 1)
09:31 bugzilla_noreply [Bug 979029] New: Move OVMF from Factory:NonFree to Factory
09:31 bugzilla_noreply [Bug 979017] Gnome-session dumps core
09:32 bugzilla_noreply [Bug 973756] Network is not working in OpenSuse Tumbleweed Aarch64 for Gigabyte MP30-AR0 (APM X-Gene 1)
09:32 bugzilla_noreply [Bug 979017] Gnome-session dumps core
09:32 bugzilla_noreply [Bug 979017] Gnome-session dumps core
09:32 bugzilla_noreply [Bug 973756] Network is not working in OpenSuse Tumbleweed Aarch64 for Gigabyte MP30-AR0 (APM X-Gene 1)
09:33 bugzilla_noreply [Bug 973756] Network is not working in OpenSuse Tumbleweed Aarch64 for Gigabyte MP30-AR0 (APM X-Gene 1)
09:37 bugzilla_noreply [Bug 978958] Game;Shooter; is not an accepted .desktop category
09:43 bugzilla_noreply [Bug 974201] Please merge "strongswan-ipsec" into the main package.
09:44 bugzilla_noreply [Bug 976863] zypper ps show all processes under vanilla kernel
09:45 bugzilla_noreply [Bug 912903] python3-requests crashes with https
09:45 bugzilla_noreply [Bug 979017] Gnome-session dumps core
09:45 bugzilla_noreply [Bug 979017] Gnome-session dumps core
09:54 bugzilla_noreply [Bug 969519] aarch64 on qemu: Can't boot after update to 4.4.2-1
09:58 bugzilla_noreply [Bug 970293] systemd 228: service file installation complains of missing [Install] section
10:02 bugzilla_noreply [Bug 978954] intel: xv video scaling doesn't work on Skylake
10:23 bugzilla_noreply [Bug 954876] Sound burst when initiating Plasma 5 Desktop
10:23 bugzilla_noreply [Bug 966179] [i915] framebuffer console remains black
10:24 bugzilla_noreply [Bug 965125] kernel crashes with divide error: 0000 in e1000e driver
10:24 bugzilla_noreply [Bug 954647] Fixes for Dell headset are missing from Leap 4.1.x kernel
10:53 bugzilla_noreply [Bug 978952] home:ecsos/MediathekView: Bug
10:54 bugzilla_noreply [Bug 978952] home:ecsos/MediathekView: Bug
10:56 bugzilla_noreply [Bug 978892] yast2-ntp-client: useless Config: Interval of the Synchronization in Minutes
10:56 bugzilla_noreply [Bug 978952] home:ecsos/MediathekView: Bug
11:01 bugzilla_noreply [Bug 967375] yast fails to find existing partitions
11:25 bugzilla_noreply [Bug 947530] Different results from /request and /search/request APIs
11:40 bugzilla_noreply [Bug 979049] New: Sennheiser BTD 500 USB does disconnect/connect loop at usage
< Previous 1 | 2 | 3 | 4 | 5 | 6 | 7 | 8 | 9 | 10 | 11 | 12 | 13 | 14 Next >
List Navigation