Mailinglist Archive: opensuse-bugs (2746 mails)

by date

< Previous 1 | 2 | 3 | 4 | 5 | 6 | 7 | 8 | 9 | 10 | 11 Next >

04 June, 2013

08:59 bugzilla_noreply [Bug 804202] Import Fedora updates repository also
09:00 bugzilla_noreply [Bug 822487] s2ram needs sigterm and mouse pointer disappears
09:01 bugzilla_noreply [Bug 794331] pulseaudio segfaults for bluetooth devices
09:04 bugzilla_noreply [Bug 794705] AUDIT-0: Request review of package lightdm-kde-greeter in repo KDE:Distro:Factory
09:04 bugzilla_noreply [Bug 819354] zypper fails to install package when pwd does not exist
09:05 bugzilla_noreply [Bug 567324] GDM_LANG check in /etc/profile.d/lang.sh makes GNOME ignore the ~/.i18n file
09:07 bugzilla_noreply [Bug 823033] New: cloud-init config file is not fully OpenSUSE compliant
09:08 bugzilla_noreply [Bug 777717] Bluetooth driver loads but does not detect any target devices on HP touchsmart tm2t
09:10 bugzilla_noreply [Bug 738520] Using bluez to disable Bluetooth USB device leaves it unusable
09:12 bugzilla_noreply [Bug 819798] No easy way to try keyboard layout during installation
09:20 bugzilla_noreply [Bug 812989] collectl -sm does not work
09:21 bugzilla_noreply [Bug 812266] Yast live CD installer ignores /etc/default/grub
09:22 bugzilla_noreply [Bug 819798] No easy way to try keyboard layout during installation
09:23 bugzilla_noreply [Bug 819798] No easy way to try keyboard layout during installation
09:28 bugzilla_noreply [Bug 765270] talloc declared LGPL-3.0+ but contains GPL-3.0+ licenses
09:42 bugzilla_noreply [Bug 809277] AUDIT-0: udisks2: udisks 2.0.9x review of new polkit privileges
09:42 bugzilla_noreply [Bug 567324] GDM_LANG check in /etc/profile.d/lang.sh makes GNOME ignore the ~/.i18n file
09:44 bugzilla_noreply [Bug 822487] s2ram needs sigterm and mouse pointer disappears
09:44 bugzilla_noreply [Bug 822487] s2ram needs sigterm and mouse pointer disappears
09:44 bugzilla_noreply [Bug 809277] AUDIT-0: udisks2: udisks 2.0.9x review of new polkit privileges
09:58 bugzilla_noreply [Bug 796243] VUL-1: CVE-2013-0222: coreutils: segmentation fault in "uniq" with long line input
09:58 bugzilla_noreply [Bug 798538] VUL-1: CVE-2013-0221: coreutils: segmentation fault in "sort -d" and "sort -M" with long line input
09:58 bugzilla_noreply [Bug 798541] VUL-1: CVE-2013-0223: coreutils: segmentation fault in "join -i" with long line input
10:17 bugzilla_noreply [Bug 815746] syslog-ng stops logging, "systemd-journal[249]: Forwarding to syslog missed 22 messages."
10:18 bugzilla_noreply [Bug 812015] syslog-ng hangs in futex
10:18 bugzilla_noreply [Bug 812266] Yast live CD installer ignores /etc/default/grub
10:50 bugzilla_noreply [Bug 822102] off-center printing on Minolta Magicolor 3300
10:56 bugzilla_noreply [Bug 822414] glibc 2.17 dns resolver fails to return query results with _ in the name
11:03 bugzilla_noreply [Bug 712726] Fix error source for a SIGSEGV crash from a small OCaml test program
11:15 bugzilla_noreply [Bug 819354] zypper fails to install package when pwd does not exist
11:22 bugzilla_noreply [Bug 818987] Shut down does not stop system / display anylonger after online update
11:22 bugzilla_noreply [Bug 823056] New: Kernel 3.7.10-1.11 build failure -
11:25 bugzilla_noreply [Bug 818987] Shut down does not stop system / display anylonger after online update
11:33 bugzilla_noreply [Bug 800788] ag_postfix_mastercf process hangs the system, after which it is killed by kernel, when saving mail server settings with Yast "Mail Server" module
11:50 bugzilla_noreply [Bug 818015] network:mail:zarafa/zarafa: Packages missing
11:52 bugzilla_noreply [Bug 796243] VUL-1: CVE-2013-0222: coreutils: segmentation fault in "uniq" with long line input
11:52 bugzilla_noreply [Bug 798538] VUL-1: CVE-2013-0221: coreutils: segmentation fault in "sort -d" and "sort -M" with long line input
11:52 bugzilla_noreply [Bug 798541] VUL-1: CVE-2013-0223: coreutils: segmentation fault in "join -i" with long line input
12:19 bugzilla_noreply [Bug 818828] Headphones do not work with Kernel 3.9.0, but do work with 3.8 Kernel in Tumbleweed
12:46 bugzilla_noreply [Bug 804202] Import Fedora updates repository also
12:55 bugzilla_noreply [Bug 822277] Ruby 2.0 mkmf create broken Makefile for ruby bindings (ruby 2.0)
12:57 bugzilla_noreply [Bug 567324] GDM_LANG check in /etc/profile.d/lang.sh makes GNOME ignore the ~/.i18n file
13:04 bugzilla_noreply [Bug 822128] lock override deletes lock
13:09 bugzilla_noreply [Bug 822277] Ruby 2.0 mkmf create broken Makefile for ruby bindings (ruby 2.0)
13:17 bugzilla_noreply [Bug 819798] No easy way to try keyboard layout during installation
13:22 bugzilla_noreply [Bug 819511] Scanner not working on Lenovo N581 laptop (neither with openSUSE 12.1 nor with 12.3)
13:24 bugzilla_noreply [Bug 822776] systemd-vconsole-setup.service misconfigures serial console
13:27 bugzilla_noreply [Bug 813767] Systemd does not work with LSB scripts for Open-Xchange 6.22
13:30 bugzilla_noreply [Bug 820572] Java VM crashed when execute eclipse environment
13:40 bugzilla_noreply [Bug 819798] No easy way to try keyboard layout during installation
13:41 bugzilla_noreply [Bug 804157] Bluetooth mouse does not work on OpenSuse 12.3 RC1
13:52 bugzilla_noreply [Bug 755533] groff -Thtml -t does not produce output for tables due to wrong devhtml/DESC image_generator entry
14:25 bugzilla_noreply [Bug 822855] systemd update breaks kiwi builds
14:30 bugzilla_noreply [Bug 819798] No easy way to try keyboard layout during installation
14:45 bugzilla_noreply [Bug 823104] New: delta rpm checksum generation incorrect
14:47 bugzilla_noreply [Bug 823105] New: permission denided
14:49 bugzilla_noreply [Bug 823104] delta rpm checksum generation incorrect
14:52 bugzilla_noreply [Bug 823110] New: permission denied while mounting cifs share in 12.3 (works in 12.2)
14:52 bugzilla_noreply [Bug 812015] syslog-ng hangs in futex
14:57 bugzilla_noreply [Bug 823105] permission denided
14:57 bugzilla_noreply [Bug 823110] permission denied while mounting cifs share in 12.3 (works in 12.2)
14:57 bugzilla_noreply [Bug 823104] delta rpm checksum generation incorrect
15:01 bugzilla_noreply [Bug 809226] nfs initscript incorrectly unmounts mountpoints at shutdown (bind= directive)
15:02 bugzilla_noreply [Bug 817651] Kernel 3.7 and newer breaks rpc.gssd -n and thus update of nfs-client package for openSUSE 12.3 needed
15:03 bugzilla_noreply [Bug 823104] delta rpm checksum generation incorrect
15:11 bugzilla_noreply [Bug 815201] virsh save hangs
15:15 bugzilla_noreply [Bug 822128] lock override deletes lock
15:41 bugzilla_noreply [Bug 822414] glibc 2.17 dns resolver fails to return query results with _ in the name
15:46 bugzilla_noreply [Bug 821505] VUL-0: subversion: maintenance updates to 1.7.10 and 1.6.23
15:50 bugzilla_noreply [Bug 819798] No easy way to try keyboard layout during installation
16:11 bugzilla_noreply [Bug 802957] Installing spotify fails, works on opensuse 12.2
16:15 bugzilla_noreply [Bug 823125] New: mkinitrd writes an incorrect md entry into /etc/mdadm in initrd
16:15 bugzilla_noreply [Bug 823104] delta rpm checksum generation incorrect
16:36 bugzilla_noreply [Bug 803095] powersave mentions: HAL powersave layer does not work
16:45 bugzilla_noreply [Bug 810133] System hangs when laptop lid is closed
17:32 bugzilla_noreply [Bug 822964] with systemd ssh connections hang when doing a re-boot
17:33 bugzilla_noreply [Bug 822964] with systemd ssh connections hang when doing a re-boot
17:45 bugzilla_noreply [Bug 822964] with systemd ssh connections hang when doing a re-boot
18:04 bugzilla_noreply [Bug 781690] OpenJDK 1.7 SSL don't work / NoSuchAlgorithmException: SunJSSE
18:19 bugzilla_noreply [Bug 823150] New: Network Manager applet does not show mobile broadband connection information.
18:29 bugzilla_noreply [Bug 822102] off-center printing on Minolta Magicolor 3300
18:54 bugzilla_noreply [Bug 821505] VUL-0: subversion: maintenance updates to 1.7.10 and 1.6.23
19:04 bugzilla_noreply [Bug 822964] with systemd ssh connections hang when doing a re-boot
19:35 bugzilla_noreply [Bug 822776] systemd-vconsole-setup.service misconfigures serial console
20:28 bugzilla_noreply [Bug 821777] Distro upgrade to Tumbleweed kernel-desktop-3.9.3-9.1.g0b5d8f5.x86_64 breaks Gnome 3.8.2 login
20:33 bugzilla_noreply [Bug 823175] New: Starting name server BIND tput: No value for $TERM and no -T specified
20:36 bugzilla_noreply [Bug 821777] Distro upgrade to Tumbleweed kernel-desktop-3.9.3-9.1.g0b5d8f5.x86_64 breaks Gnome 3.8.2 login
20:39 bugzilla_noreply [Bug 821777] Distro upgrade to Tumbleweed kernel-desktop-3.9.3-9.1.g0b5d8f5.x86_64 breaks Gnome 3.8.2 login
20:41 bugzilla_noreply [Bug 821777] Distro upgrade to Tumbleweed kernel-desktop-3.9.3-9.1.g0b5d8f5.x86_64 breaks Gnome 3.8.2 login
20:41 bugzilla_noreply [Bug 755533] groff -Thtml -t does not produce output for tables due to wrong devhtml/DESC image_generator entry
20:42 bugzilla_noreply [Bug 821777] Distro upgrade to Tumbleweed kernel-desktop-3.9.3-9.1.g0b5d8f5.x86_64 breaks Gnome 3.8.2 login
20:44 bugzilla_noreply [Bug 821777] Distro upgrade to Tumbleweed kernel-desktop-3.9.3-9.1.g0b5d8f5.x86_64 breaks Gnome 3.8.2 login
20:48 bugzilla_noreply [Bug 820367] New Tumbleweed Kernel Version IDs break multiversion/purge-kernel
20:48 bugzilla_noreply [Bug 821777] Distro upgrade to Tumbleweed kernel-desktop-3.9.3-9.1.g0b5d8f5.x86_64 breaks Gnome 3.8.2 login
21:57 bugzilla_noreply [Bug 822487] s2ram needs sigterm and mouse pointer disappears
22:32 bugzilla_noreply [Bug 814680] libvirt needs --without-selinux
22:54 bugzilla_noreply [Bug 812266] Yast live CD installer ignores /etc/default/grub

05 June, 2013

01:49 bugzilla_noreply [Bug 821735] [Kernel:HEAD]usb_audio: Warning! Unlikely big volume range (=6144), cval->res is probably wrong.
02:15 bugzilla_noreply [Bug 817651] Kernel 3.7 and newer breaks rpc.gssd -n and thus update of nfs-client package for openSUSE 12.3 needed
03:05 bugzilla_noreply [Bug 815962] grub2 network boot fails -> couldn't send network packet
03:21 bugzilla_noreply [Bug 821387] grub2 always asks for a password not only if I try to edit config when booting
04:30 bugzilla_noreply [Bug 823224] New: AutoYaST not setting root user password or adding any users from <users> list
05:13 bugzilla_noreply [Bug 819798] No easy way to try keyboard layout during installation
05:43 bugzilla_noreply [Bug 821505] VUL-0: subversion: maintenance updates to 1.7.10 and 1.6.23
06:35 bugzilla_noreply [Bug 823024] cloud-init is missing init scripts
07:16 bugzilla_noreply [Bug 822487] radeon[HD 4350] s2ram needs sigterm and mouse pointer disappears
07:52 bugzilla_noreply [Bug 822102] ImageMagick: /usr/bin/convert .eps file into PDF changes bounding box which results off-center printing
07:53 bugzilla_noreply [Bug 822102] ImageMagick: /usr/bin/convert .eps file into PDF changes bounding box which results off-center printing
08:17 bugzilla_noreply [Bug 822776] systemd-vconsole-setup.service misconfigures serial console
08:18 bugzilla_noreply [Bug 821366] mdmon doesn't start during boot although RAID 1 is present
08:23 bugzilla_noreply [Bug 781690] OpenJDK 1.7 SSL don't work / NoSuchAlgorithmException: SunJSSE
08:26 bugzilla_noreply [Bug 822964] with systemd ssh connections hang when doing a re-boot
08:53 bugzilla_noreply [Bug 823273] New: texlive from opensuse produces different output than texlive from texlive.org
08:55 bugzilla_noreply [Bug 823273] texlive from opensuse produces different output than texlive from texlive.org
08:56 bugzilla_noreply [Bug 823273] texlive from opensuse produces different output than texlive from texlive.org
08:57 bugzilla_noreply [Bug 823273] texlive from opensuse produces different output than texlive from texlive.org
08:58 bugzilla_noreply [Bug 823273] texlive from opensuse produces different output than texlive from texlive.org
09:00 bugzilla_noreply [Bug 781690] OpenJDK 1.7 SSL don't work / NoSuchAlgorithmException: SunJSSE
09:05 bugzilla_noreply [Bug 821375] Installation DVD ISO provided as NFS source will not be mounted
09:07 bugzilla_noreply [Bug 822128] lock override deletes lock
09:25 bugzilla_noreply [Bug 815233] systemd prevents system from hibernation (ThinkPad T520)
09:33 bugzilla_noreply [Bug 808338] M17N/libchewing: malformed source and ambiguous data package name which lose dependency
09:34 bugzilla_noreply [Bug 818500] Bugfix release 4.10.3 is available
09:43 bugzilla_noreply [Bug 822733] fam service + systemd => no fam service
09:44 bugzilla_noreply [Bug 823292] New: Man page for sudo does not match version supplied
09:45 bugzilla_noreply [Bug 821422] cpu reporting in top, vmstat, gkrellm, ... fails with kernel 3.10-rc2
09:46 bugzilla_noreply [Bug 822653] Base:System/netcfg: sieve gets mapped to Port 2000.
09:51 bugzilla_noreply [Bug 810344] fancontrol not starting
09:57 bugzilla_noreply [Bug 791485] rpm aaa_base 12.2-2.14.1 overwrites /etc/adjtime
09:58 bugzilla_noreply [Bug 808067] update Evolution / Evolution-Data-Server / Gtkhtml to 3.6.4
10:00 bugzilla_noreply [Bug 814814] libtag corrupts characters in music file tag fields when using special characters (eg. äÄöÖüÜß)
10:00 bugzilla_noreply [Bug 755533] groff -Thtml -t does not produce output for tables due to wrong devhtml/DESC image_generator entry
10:04 bugzilla_noreply [Bug 800788] ag_postfix_mastercf process hangs the system, after which it is killed by kernel, when saving mail server settings with Yast "Mail Server" module
10:05 bugzilla_noreply [Bug 791485] rpm aaa_base 12.2-2.14.1 overwrites /etc/adjtime
10:16 bugzilla_noreply [Bug 817651] Kernel 3.7 and newer breaks rpc.gssd -n and thus update of nfs-client package for openSUSE 12.3 needed
10:28 bugzilla_noreply [Bug 793940] "Set date and time automatically" one hour off at next startup
10:46 bugzilla_noreply [Bug 813705] apache 2.4 fails to start - Invalid command 'User'
10:56 bugzilla_noreply [Bug 813705] apache 2.4 fails to start - Invalid command 'User'
11:02 bugzilla_noreply [Bug 822277] Ruby 2.0 mkmf create broken Makefile for ruby bindings (ruby 2.0)
11:05 bugzilla_noreply [Bug 579403] Midnight Commander Takes 5 minutes to load. Then works fine.
11:07 bugzilla_noreply [Bug 579403] Midnight Commander Takes 5 minutes to load. Then works fine.
11:13 bugzilla_noreply [Bug 823308] New: bugzilla displays wrong timestamps (since bugzilla update last weekend)
11:23 bugzilla_noreply [Bug 822653] Base:System/netcfg: sieve gets mapped to Port 2000.
11:25 bugzilla_noreply [Bug 822653] Base:System/netcfg: sieve gets mapped to Port 2000.
11:26 bugzilla_noreply [Bug 822277] Ruby 2.0 mkmf create broken Makefile for ruby bindings (ruby 2.0)
11:27 bugzilla_noreply [Bug 816942] Recent update kills audio
11:58 bugzilla_noreply [Bug 728559] LibreOffice Impress problem with slide transition (OpenGL?)
11:59 bugzilla_noreply [Bug 728559] LibreOffice Impress problem with slide transition (OpenGL?)
12:42 bugzilla_noreply [Bug 550021] cdrecord of Schily's cdrtools
12:49 bugzilla_noreply [Bug 755533] groff -Thtml -t does not produce output for tables due to wrong devhtml/DESC image_generator entry
13:02 bugzilla_noreply [Bug 823110] permission denied while mounting cifs share in 12.3 (works in 12.2)
13:07 bugzilla_noreply [Bug 765270] talloc declared LGPL-3.0+ but contains GPL-3.0+ licenses
13:19 bugzilla_noreply [Bug 821879] udev update breaks network
13:42 bugzilla_noreply [Bug 821879] udev update breaks network
14:04 bugzilla_noreply [Bug 821978] 32bit pattern not working after minimal installation
14:15 bugzilla_noreply [Bug 821879] udev update breaks network
14:25 bugzilla_noreply [Bug 821879] udev update breaks network
14:45 bugzilla_noreply [Bug 823224] AutoYaST not setting root user password or adding any users from <users> list
14:48 bugzilla_noreply [Bug 823354] New: vmw_balloon.ko cannot be loaded
15:15 bugzilla_noreply [Bug 773575] libzypp does not handle %posttrans scriptlets well (was: texlive update takes ages)
15:18 bugzilla_noreply [Bug 811368] Incorrect SELinux labels in /dev causes systemd to loop
15:22 bugzilla_noreply [Bug 813705] apache 2.4 fails to start - Invalid command 'User'
15:24 bugzilla_noreply [Bug 811368] Incorrect SELinux labels in /dev causes systemd to loop
15:32 bugzilla_noreply [Bug 823364] New: rpcbind - loopback check too strict
15:32 bugzilla_noreply [Bug 803316] Installation over tftp does not fully work
15:34 bugzilla_noreply [Bug 823110] permission denied while mounting cifs share in 12.3 (works in 12.2)
15:38 bugzilla_noreply [Bug 796243] VUL-1: CVE-2013-0222: coreutils: segmentation fault in "uniq" with long line input
15:44 bugzilla_noreply [Bug 796243] VUL-1: CVE-2013-0222: coreutils: segmentation fault in "uniq" with long line input
16:00 bugzilla_noreply [Bug 818494] hylafax: No faxing over the network since upgrade from 12.2
16:09 bugzilla_noreply [Bug 823376] New: SUSE Xen Server does not appear to forward packets properly when the GRO is enabled.
16:16 bugzilla_noreply [Bug 823377] New: scrollkeeper-get-content-list does not belong to rarian-scrollkeeper-compat
16:17 bugzilla_noreply [Bug 823377] scrollkeeper-get-content-list does not belong to rarian-scrollkeeper-compat
16:34 bugzilla_noreply [Bug 813705] apache 2.4 fails to start - Invalid command 'User'
16:41 bugzilla_noreply [Bug 821422] cpu reporting in top, vmstat, gkrellm, ... fails with kernel 3.10-rc2
16:53 bugzilla_noreply [Bug 725888] zypper: wildcard not properly resolved
17:07 bugzilla_noreply [Bug 725888] zypper: wildcard not properly resolved
17:48 bugzilla_noreply [Bug 823376] SUSE Xen Server does not appear to forward packets properly when the GRO is enabled.
18:15 bugzilla_noreply [Bug 813705] apache 2.4 fails to start - Invalid command 'User'
18:22 bugzilla_noreply [Bug 768832] mysqldump 5.5.25 displays general_log table error and has non-zero exit-code
18:28 bugzilla_noreply [Bug 823410] New: Xvfb missing randr support
18:29 bugzilla_noreply [Bug 823410] Xvfb missing randr support
18:32 bugzilla_noreply [Bug 823410] Xvfb missing randr support
18:34 bugzilla_noreply [Bug 823410] Xvfb missing randr support
18:51 bugzilla_noreply [Bug 661646] LibreOffice (and OOO) Impress plays no sound with pps presentations which include sound
19:23 bugzilla_noreply [Bug 801473] Closing the lid doesn't suspend the laptop and some the buttons to control the brightness doesn't work
19:40 bugzilla_noreply [Bug 803095] powersave mentions: HAL powersave layer does not work
19:49 bugzilla_noreply [Bug 803095] powersave mentions: HAL powersave layer does not work
20:02 bugzilla_noreply [Bug 823432] New: Release notes for 12.3 do not warn about floppy in bios problem
20:10 bugzilla_noreply [Bug 806575] iwlwifi performs extremely bad in noisy env. iwlwifi 0000:02:00.0: fail to flush all tx fifo queues
21:15 bugzilla_noreply [Bug 817651] Kernel 3.7 and newer breaks rpc.gssd -n and thus update of nfs-client package for openSUSE 12.3 needed
22:30 bugzilla_noreply [Bug 823455] New: xserver does not start with mach64 driver on 64 bit systems
22:57 bugzilla_noreply [Bug 799559] unexplainable messages from floppy driver, possibly after suspend to RAM

06 June, 2013

00:31 bugzilla_noreply [Bug 823224] AutoYaST not setting root user password or adding any users from <users> list
00:35 bugzilla_noreply [Bug 823224] AutoYaST not setting root user password or adding any users from <users> list
00:38 bugzilla_noreply [Bug 812887] openSUSE 12.1 XEN kernel disables interface because too many frags
00:40 bugzilla_noreply [Bug 823224] AutoYaST not setting root user password or adding any users from <users> list
02:01 bugzilla_noreply [Bug 823364] rpcbind - loopback check too strict
03:06 bugzilla_noreply [Bug 821366] mdmon doesn't start during boot although RAID 1 is present
04:50 bugzilla_noreply [Bug 822102] ImageMagick: /usr/bin/convert .eps file into PDF changes bounding box which results off-center printing
04:59 bugzilla_noreply [Bug 822102] ImageMagick: /usr/bin/convert .eps file into PDF changes bounding box which results off-center printing
05:05 bugzilla_noreply [Bug 823484] New: pam_ssh stays as user if no session tty
05:13 bugzilla_noreply [Bug 823484] pam_ssh stays as user if no session tty
05:14 bugzilla_noreply [Bug 823485] New: RN: openSUSE 12.3 update wanted
05:14 bugzilla_noreply [Bug 819707] systemd journal service
05:14 bugzilla_noreply [Bug 823432] Release notes for 12.3 do not warn about floppy in bios problem
05:24 bugzilla_noreply [Bug 823484] pam_ssh stays as user if no session tty
05:37 bugzilla_noreply [Bug 819982] squid-3.2.6 dies regularly with assertion failed: store.cc:1851: "isEmpty()"
05:41 bugzilla_noreply [Bug 823484] pam_ssh stays as user if no session tty
05:51 bugzilla_noreply [Bug 822102] ImageMagick: /usr/bin/convert .eps file into PDF changes bounding box which results off-center printing
06:38 bugzilla_noreply [Bug 822102] ImageMagick: /usr/bin/convert .eps file into PDF changes bounding box which results off-center printing
07:03 bugzilla_noreply [Bug 630282] MySQL embedded lacks tcpd-devel dependency
07:11 bugzilla_noreply [Bug 823432] Release notes for 12.3 do not warn about floppy in bios problem
07:17 bugzilla_noreply [Bug 799559] unexplainable messages from floppy driver, possibly after suspend to RAM
07:46 bugzilla_noreply [Bug 819707] systemd journal service
08:19 bugzilla_noreply [Bug 819707] systemd journal service
08:37 bugzilla_noreply [Bug 823484] pam_ssh stays as user if no session tty
08:46 bugzilla_noreply [Bug 823410] Xvfb missing randr support
08:56 bugzilla_noreply [Bug 823455] xserver does not start with mach64 driver on 64 bit systems
09:00 bugzilla_noreply [Bug 822165] tcpdump and dumpcap crash with segfault
09:00 bugzilla_noreply [Bug 823455] xserver does not start with mach64 driver on 64 bit systems
09:14 bugzilla_noreply [Bug 823432] Release notes for 12.3 do not warn about floppy in bios problem
09:30 bugzilla_noreply [Bug 823549] [SLE-openSUSE-Hardening]: Samba packaged with unnecessary man pages
09:48 bugzilla_noreply [Bug 823549] [SLE-openSUSE-Hardening]: Samba packaged with unnecessary man pages
09:52 bugzilla_noreply [Bug 822578] sub-second timestamp resolution im repomd.xml may be problematic
09:55 bugzilla_noreply [Bug 822578] sub-second timestamp resolution im repomd.xml may be problematic
10:17 bugzilla_noreply [Bug 823224] AutoYaST not setting root user password or adding any users from <users> list
10:56 bugzilla_noreply [Bug 725888] zypper: wildcard not properly resolved
11:02 bugzilla_noreply [Bug 812266] Yast live CD installer ignores /etc/default/grub
11:05 bugzilla_noreply [Bug 822578] sub-second timestamp resolution im repomd.xml may be problematic
11:12 bugzilla_noreply [Bug 812266] Yast live CD installer ignores /etc/default/grub
11:15 bugzilla_noreply [Bug 823576] New: liferea updated to 1.8.14 fixing many tt-rss issues
11:20 bugzilla_noreply [Bug 823432] Release notes for 12.3 do not warn about floppy in bios problem
11:20 bugzilla_noreply [Bug 823485] RN: openSUSE 12.3 update wanted
11:20 bugzilla_noreply [Bug 823485] RN: openSUSE 12.3 update wanted
11:21 bugzilla_noreply [Bug 819707] systemd journal service
11:21 bugzilla_noreply [Bug 823485] RN: openSUSE 12.3 update wanted
11:25 bugzilla_noreply [Bug 819982] squid-3.2.6 dies regularly with assertion failed: store.cc:1851: "isEmpty()"
11:30 bugzilla_noreply [Bug 812266] Yast live CD installer ignores /etc/default/grub
11:31 bugzilla_noreply [Bug 819437] All KDE/Qt programs/libs linking to QT_QTUITOOLS_LIBRARY (might) have to be rebuilt on Qt update
11:37 bugzilla_noreply [Bug 794331] pulseaudio segfaults for bluetooth devices
11:47 bugzilla_noreply [Bug 823549] [SLE-openSUSE-Hardening]: Samba packaged with unnecessary man pages
11:50 bugzilla_noreply [Bug 822578] sub-second timestamp resolution im repomd.xml may be problematic
11:50 bugzilla_noreply [Bug 823485] RN: openSUSE 12.3 update wanted
12:04 bugzilla_noreply [Bug 814947] [Maint:1592] MESA: [SNB] hang on gnome-shell start
12:06 bugzilla_noreply [Bug 786024] vsftpd broken: audit_log_acct_message() failed: Operation not permitted
12:21 bugzilla_noreply [Bug 823576] liferea updated to 1.8.14 fixing many tt-rss issues
12:24 bugzilla_noreply [Bug 823594] New: Updates to Opera have been placed in both Updates and Updates-Non-OSS
12:27 bugzilla_noreply [Bug 796243] VUL-1: CVE-2013-0222: coreutils: segmentation fault in "uniq" with long line input
12:38 bugzilla_noreply [Bug 823549] [SLE-openSUSE-Hardening]: Samba packaged with unnecessary man pages
12:42 bugzilla_noreply [Bug 822465] ctags / etags update-alternative warnings in %post
< Previous 1 | 2 | 3 | 4 | 5 | 6 | 7 | 8 | 9 | 10 | 11 Next >
List Navigation