Mailinglist Archive: opensuse-bugs (5251 mails)

< Previous Next >
[Bug 496253] New: Error compiling kdelibs (ld can't link)
  • From: bugzilla_noreply@xxxxxxxxxx
  • Date: Sat, 18 Apr 2009 08:49:56 -0600 (MDT)
  • Message-id: <bug-496253-21960@xxxxxxxxxxxxxxxxxxxxxxxx/>

Summary: Error compiling kdelibs (ld can't link)
Classification: openSUSE
Product: openSUSE 11.1
Version: Final
Platform: i686
OS/Version: openSUSE 11.1
Status: NEW
Severity: Normal
Priority: P5 - None
Component: Basesystem
AssignedTo: bnc-team-screening@xxxxxxxxxxxxxxxxxxxxxx
ReportedBy: ruchir.brahmbhatt@xxxxxxxxxxx
QAContact: qa@xxxxxxx
Found By: ---

User-Agent: Mozilla/5.0 (X11; U; Linux i686; en-US; rv:
Gecko/2009032600 SUSE/3.0.8-1.1.1 Firefox/3.0.8

I'm trying to build kde4 trunk by following this link.

I can't build kdelibs it always gives error even if there's no error in
compilation. Probably ld is broken.

Linking CXX shared library ../lib/
collect2: ld returned 1 exit status
make[2]: *** [lib/] Error 1
make[1]: *** [khtml/CMakeFiles/khtml.dir/all] Error 2
make: *** [all] Error 2

I can provide full console log if needed.

Reproducible: Always

Steps to Reproduce:
1. Follow to build kde4 trunk.
2. Build kdelibs.
Actual Results:
linking fails.

Expected Results:
compilation should complete

Configure bugmail:
------- You are receiving this mail because: -------
You are on the CC list for the bug.

< Previous Next >
Follow Ups