Mailinglist Archive: obs-tests (44 mails)

< Previous Next >
[obs-tests] Build failed in Jenkins: obs_osc2_testsuite_master #31
  • From: admin@xxxxxxxxxxxx
  • Date: Sat, 14 Jul 2012 05:02:08 +0200 (CEST)
  • Message-id: <1912435197.311342234928994.JavaMail.jenkins@ci-opensuse>
See <http://ci.opensuse.org/job/obs_osc2_testsuite_master/31/changes>

Changes:

[suse-tux] - test.util.test_cpio_fixtures: added missing
new_ascii_reader1_premature_end.cpio file

------------------------------------------
Started by an SCM change
Building in workspace <http://ci.opensuse.org/job/obs_osc2_testsuite_master/ws/>
Checkout:workspace / <http://ci.opensuse.org/job/obs_osc2_testsuite_master/ws/>
- hudson.remoting.LocalChannel@73c473c4
Using strategy: Default
Last Built Revision: Revision aea7ad2f259580e063a0077f72cfe609c6165ddb
(origin/master)
Checkout:workspace / <http://ci.opensuse.org/job/obs_osc2_testsuite_master/ws/>
- hudson.remoting.LocalChannel@73c473c4
Fetching changes from 1 remote Git repository
Fetching upstream changes from git://github.com/openSUSE/osc2.git
Commencing build of Revision 2a799cb23775a5ab29707b91c99344698026ff9a
(origin/master)
Checking out Revision 2a799cb23775a5ab29707b91c99344698026ff9a (origin/master)
[workspace] $ /bin/sh -xe /tmp/hudson499326251677093195.sh
+ rm -rf nosetests.xml coverage.xml .coverage
+ nosetests --with-coverage --with-xunit --cover-package=osc
.........F...............................................................................................................................................................................................................................................................................................................................................................................................
======================================================================
FAIL: test NewAsciiWriter's append method
----------------------------------------------------------------------
Traceback (most recent call last):
File
"<http://ci.opensuse.org/job/obs_osc2_testsuite_master/ws/test/util/test_cpio.py";,>
line 608, in test18
self.assertEqual(hdr.mtime, 1340493596)
AssertionError: 1340566895 != 1340493596

Name Stmts Miss Cover Missing
-----------------------------------------------
osc 1 0 100%
osc.build 79 4 95% 132-136
osc.builder 74 0 100%
osc.core 19 2 89% 13, 33
osc.httprequest 180 24 87% 61, 70, 132, 148, 169, 180, 255, 258,
260, 268-275, 280-283, 312, 316, 372, 377, 379
osc.oscargs 145 1 99% 45
osc.remote 299 11 96% 34-35, 101, 135, 159, 181, 185, 240,
265, 470-471
osc.source 68 2 97% 52, 111
osc.util 1 0 100%
osc.util.cpio 279 5 98% 174, 305, 313, 340, 362
osc.util.io 92 6 93% 73, 76, 79, 83, 109, 163
osc.util.xml 23 0 100%
osc.util.xpath 265 4 98% 26-27, 387, 585
osc.wc 1 0 100%
osc.wc.base 173 20 88% 77-80, 105, 117, 126, 136, 215, 220,
225, 230, 235, 240, 252, 256, 280, 331, 351, 371
osc.wc.convert 71 6 92% 30-32, 48-49, 59
osc.wc.package 792 44 94% 38-39, 80-83, 116, 165-167, 183, 231,
329-335, 370, 385, 415, 421, 423-424, 457, 671-673, 700, 802-803, 808-810,
846-847, 908, 958, 997, 1007, 1062-1063, 1110-1112, 1226
osc.wc.project 397 20 95% 89, 91-92, 119-125, 224-225, 268,
336-337, 404, 574, 605-607
osc.wc.util 389 28 93% 139, 149, 153, 162, 173, 177, 181, 191,
221, 229, 240, 252, 304, 353, 572, 762-763, 769, 773-776, 778-779, 804, 806,
810, 856
-----------------------------------------------
TOTAL 3348 177 95%
----------------------------------------------------------------------
Ran 393 tests in 33.751s

FAILED (failures=1)
Build step 'Execute shell' marked build as failure
Skipping Cobertura coverage report as build was not UNSTABLE or better ...
Recording test results

--
To unsubscribe, e-mail: obs-tests+unsubscribe@xxxxxxxxxxxx
To contact the owner, e-mail: obs-tests+owner@xxxxxxxxxxxx

< Previous Next >
This Thread
Follow Ups
References