Mailinglist Archive: libyui-devel (66 mails)

< Previous Next >
[libyui-devel] Build failed in Jenkins: libyui-qt-pkg-HEAD #32
  • From: hudson@xxxxxxx
  • Date: Thu, 28 Jun 2012 16:10:49 +0200 (CEST)
  • Message-id: <396014795.558.1340892649673.JavaMail.jenkins@river>
See <http://river.suse.de/job/libyui-qt-pkg-HEAD/32/>

------------------------------------------
[...truncated 33 lines...]
++ trap 'error_exit $?' ERR
++ export ALLOW_OBS_SUBMIT=yes
++ ALLOW_OBS_SUBMIT=yes
+ . .hudson-scripts/setup-buildenvironment
++ export RUNTESTS=1
++ RUNTESTS=1
++ export ICEJOBS=4
++ ICEJOBS=4
++ export CMAKE_INSTALL_PREFIX=/usr
++ CMAKE_INSTALL_PREFIX=/usr
+++ uname -m
+++ hostname -f
++ export 'CMAKEPARAS=-DBUILDNAME=x86_64 -DSITE=app5
-DCMAKE_INSTALL_PREFIX=/usr'
++ CMAKEPARAS='-DBUILDNAME=x86_64 -DSITE=app5 -DCMAKE_INSTALL_PREFIX=/usr'
++ export ICECCDIR=<http://river.suse.de/job/libyui-qt-pkg-HEAD/ws/ICECC>
++ ICECCDIR=<http://river.suse.de/job/libyui-qt-pkg-HEAD/ws/ICECC>
++ echo 'Configuring cmake for Icecream ...'
Configuring cmake for Icecream ...
++ rm -rf <http://river.suse.de/job/libyui-qt-pkg-HEAD/ws/ICECC>
++ mkdir -p <http://river.suse.de/job/libyui-qt-pkg-HEAD/ws/ICECC>
++ pushd <http://river.suse.de/job/libyui-qt-pkg-HEAD/ws/ICECC>
~/hudson/workspace/libyui-qt-pkg-HEAD/ICECC
~/hudson/workspace/libyui-qt-pkg-HEAD
+++ icecc --build-native
+++ sed -e 's/creating //'
+++ grep .tar.gz
+++ tail -1
loader cannot load itself
ldd: exited with unknown exit code (127)
++ export ICECC_ENV=113a946f1f881e1c8471fd19560edb17.tar.gz
++ ICECC_ENV=113a946f1f881e1c8471fd19560edb17.tar.gz
++ export ICECC_ENV=113a946f1f881e1c8471fd19560edb17.tar.gz
++ ICECC_ENV=113a946f1f881e1c8471fd19560edb17.tar.gz
++ export
ICECC_VERSION=<http://river.suse.de/job/libyui-qt-pkg-HEAD/ws/ICECC/113a946f1f881e1c8471fd19560edb17.tar.gz>
++
ICECC_VERSION=<http://river.suse.de/job/libyui-qt-pkg-HEAD/ws/ICECC/113a946f1f881e1c8471fd19560edb17.tar.gz>
++ popd
~/hudson/workspace/libyui-qt-pkg-HEAD
++ pushd <http://river.suse.de/job/libyui-qt-pkg-HEAD/ws/>
~/hudson/workspace/libyui-qt-pkg-HEAD ~/hudson/workspace/libyui-qt-pkg-HEAD
++ export ICECREAM=-DCMAKE_CXX_COMPILER=/opt/icecream/bin/g++
++ ICECREAM=-DCMAKE_CXX_COMPILER=/opt/icecream/bin/g++
++ export CXX=/opt/icecream/bin/g++
++ CXX=/opt/icecream/bin/g++
++ export 'MAKECMD=make -j 4'
++ MAKECMD='make -j 4'
++ export MAKEBIN=make
++ MAKEBIN=make
++ export
PATH=/opt/icecream/bin:/sbin:/usr/sbin:/usr/local/sbin:/root/bin:/usr/local/bin:/usr/bin:/bin:/usr/X11R6/bin:/usr/games
++
PATH=/opt/icecream/bin:/sbin:/usr/sbin:/usr/local/sbin:/root/bin:/usr/local/bin:/usr/bin:/bin:/usr/X11R6/bin:/usr/games
++ popd
~/hudson/workspace/libyui-qt-pkg-HEAD
++ export CHECKOUTDIR=<http://river.suse.de/job/libyui-qt-pkg-HEAD/ws/checkout>
++ CHECKOUTDIR=<http://river.suse.de/job/libyui-qt-pkg-HEAD/ws/checkout>
++ export BUILDDIR=<http://river.suse.de/job/libyui-qt-pkg-HEAD/ws/build>
++ BUILDDIR=<http://river.suse.de/job/libyui-qt-pkg-HEAD/ws/build>
++ export
PACKAGEDIR=<http://river.suse.de/job/libyui-qt-pkg-HEAD/ws/build/package>
++ PACKAGEDIR=<http://river.suse.de/job/libyui-qt-pkg-HEAD/ws/build/package>
++ export
ARTIFACTS=<http://river.suse.de/job/libyui-qt-pkg-HEAD/32/artifact/.artifacts>
++
ARTIFACTS=<http://river.suse.de/job/libyui-qt-pkg-HEAD/32/artifact/.artifacts>
++ export OBSDIR=<http://river.suse.de/job/libyui-qt-pkg-HEAD/ws/OBS>
++ OBSDIR=<http://river.suse.de/job/libyui-qt-pkg-HEAD/ws/OBS>
++ export RPMTOPDIR=<http://river.suse.de/job/libyui-qt-pkg-HEAD/ws/rpm>
++ RPMTOPDIR=<http://river.suse.de/job/libyui-qt-pkg-HEAD/ws/rpm>
++ export RPMOUT=<http://river.suse.de/job/libyui-qt-pkg-HEAD/ws/rpm/rpms>
++ RPMOUT=<http://river.suse.de/job/libyui-qt-pkg-HEAD/ws/rpm/rpms>
++ export
RPMBUILDDIR=<http://river.suse.de/job/libyui-qt-pkg-HEAD/ws/rpm/rpmbuild>
++ RPMBUILDDIR=<http://river.suse.de/job/libyui-qt-pkg-HEAD/ws/rpm/rpmbuild>
++ export
RPMBUILDROOT=<http://river.suse.de/job/libyui-qt-pkg-HEAD/ws/rpm/rpmbuildroot>
++
RPMBUILDROOT=<http://river.suse.de/job/libyui-qt-pkg-HEAD/ws/rpm/rpmbuildroot>
++ rm -rf <http://river.suse.de/job/libyui-qt-pkg-HEAD/ws/rpm/rpms>
++ rm -rf <http://river.suse.de/job/libyui-qt-pkg-HEAD/ws/rpm/rpmbuild>
++ rm -rf <http://river.suse.de/job/libyui-qt-pkg-HEAD/ws/rpm/rpmbuildroot>
++ rm -rf <http://river.suse.de/job/libyui-qt-pkg-HEAD/32/artifact/.artifacts>
++ rm -rf <http://river.suse.de/job/libyui-qt-pkg-HEAD/ws/OBS>
++ rm -rf '<http://river.suse.de/job/libyui-qt-pkg-HEAD/ws/copy-to-slave*.dir'>
++ [[ '' == 1 ]]
++ rm -rf <http://river.suse.de/job/libyui-qt-pkg-HEAD/ws/build>
++ mkdir -p <http://river.suse.de/job/libyui-qt-pkg-HEAD/ws/build>
++ mkdir -p <http://river.suse.de/job/libyui-qt-pkg-HEAD/ws/rpm>
++ mkdir -p <http://river.suse.de/job/libyui-qt-pkg-HEAD/ws/rpm/rpms>
++ mkdir -p <http://river.suse.de/job/libyui-qt-pkg-HEAD/ws/rpm/rpmbuild>
++ mkdir -p <http://river.suse.de/job/libyui-qt-pkg-HEAD/ws/rpm/rpmbuildroot>
++ mkdir -p <http://river.suse.de/job/libyui-qt-pkg-HEAD/32/artifact/.artifacts>
++ mkdir -p <http://river.suse.de/job/libyui-qt-pkg-HEAD/ws/OBS>
++ cat
+ test -d <http://river.suse.de/job/libyui-qt-pkg-HEAD/ws/build/package>
+ mkdir -p <http://river.suse.de/job/libyui-qt-pkg-HEAD/ws/build/package>
+ cd <http://river.suse.de/job/libyui-qt-pkg-HEAD/ws/checkout>
+ make -f Makefile.cvs
rm -rf build
mkdir build ; \
cd build ; \
cmake -DCMAKE_BUILD_TYPE=RELEASE ..
-- The C compiler identification is GNU 4.7.0
-- The CXX compiler identification is GNU 4.7.0
-- Check for working C compiler: /opt/icecream/bin/gcc
-- Check for working C compiler: /opt/icecream/bin/gcc -- works
-- Detecting C compiler ABI info
-- Detecting C compiler ABI info - done
-- Check for working CXX compiler: /opt/icecream/bin/g++
-- Check for working CXX compiler: /opt/icecream/bin/g++ -- works
-- Detecting CXX compiler ABI info
-- Detecting CXX compiler ABI info - done
-- USE_C_STD not set, defaulting to gnu99
-- Found Doxygen: /usr/bin/doxygen (found version "1.7.6.1")
-- Found Dot: /usr/bin/dot
-- Checking for LaTeX: not found
-- Looking for Q_WS_X11
-- Looking for Q_WS_X11 - found
-- Looking for Q_WS_WIN
-- Looking for Q_WS_WIN - not found.
-- Looking for Q_WS_QWS
-- Looking for Q_WS_QWS - not found.
-- Looking for Q_WS_MAC
-- Looking for Q_WS_MAC - not found.
-- Found Qt4: /usr/bin/qmake (found version "4.8.0")
-- ZYpp path not set. Looking for it.
-- ZYpp found: includes in /usr/include, library in /usr/lib64/libzypp.so
-- Found Libyui: (Version: 2.42.0)
-- Found Libyui-qt: (Version: 2.42.0)
-- zypp found
--
--
********************************************************************************
--
-- libyui-qt-pkg has been configured with following options:
--
-- Plugin-Name: qt-pkg
-- Library-Dependencies: Qt;Zypp;Libyui;Libyui-qt
-- Plugin is for use with:
-- targetlib to build: yui-qt-pkg
--
-- Version: 2.21.25
-- SO-Version: 4.0.0
--
-- Used Build-Option: RELEASE
-- Used Compiler-Flags: -std=c++0x -fmessage-length=0
-Wall -Werror -O3
-- linking against: zypp
-- using includes from:
/usr/include/QtDesigner;/usr/include/QtDeclarative;/usr/include/QtScriptTools;/usr/include/QtDBus;/usr/include/QtDesigner;/usr/include/QtXml;/usr/include/QtSql;/usr/include/QtOpenGL;/usr/include/QtMultimedia;/usr/include/QtNetwork;/usr/include/QtXmlPatterns;/usr/include/QtHelp;/usr/include/QtUiTools;/usr/include/QtTest;/usr/include/QtScript;/usr/include/QtSvg;/usr/include/Qt3Support;/usr/include/QtGui;/usr/include/QtCore;/usr/share/qt4/mkspecs/default;/usr/include;/usr/include/QtCore;/usr/include/yui/qt;/usr/include/yui;/usr/include;/usr/include
--
--
-- Install to Prefix: /usr
-- use Shared-Dir: /usr/share
-- use Library-Dir: /usr/lib64/yui
-- use Include-Dir: /usr/include/yui/qt-pkg
-- use CMake Plugin-InstallDir: /usr/lib64/cmake/libyui-qt-pkg
-- use Doc-Dir: /usr/share/doc/libyui-qt-pkg4
-- Data-Dir: /usr/share/libyui
-- Theme-Dir: /usr/share/libyui/theme
--
-- Disable shared library: OFF
-- Include Debug-Symbols in library: OFF
-- Build a static library, too: OFF
-- Build the examples, too: OFF
--
--
********************************************************************************
--
-- Configuring done
-- Generating done
-- Build files have been written to:
<http://river.suse.de/job/libyui-qt-pkg-HEAD/ws/checkout/build>
+ cd build
+ make clean
+ make
[ 1%] Generating YQPkgVersionsView.moc
[ 2%] Generating YQPackageSelectorBase.moc
[ 3%] Generating YQPackageSelector.moc
[ 5%] Generating YQPatternSelector.moc
[ 6%] Generating YQSimplePatchSelector.moc
[ 7%] Generating YQPkgChangeLogView.moc
[ 8%] Generating YQPkgChangesDialog.moc
[ 10%] Generating YQPkgConflictDialog.moc
[ 11%] Generating YQPkgConflictList.moc
[ 12%] Generating YQPkgDependenciesView.moc
[ 14%] Generating YQPkgDescriptionDialog.moc
[ 15%] Generating YQPkgDescriptionView.moc
[ 16%] Generating YQPkgDiskUsageList.moc
[ 17%] Generating YQPkgDiskUsageWarningDialog.moc
[ 19%] Generating YQPkgFileListView.moc
[ 20%] Generating YQPkgFilterTab.moc
[ 21%] Generating YQPkgGenericDetailsView.moc
[ 23%] Generating YQPkgHistoryDialog.moc
[ 24%] Generating YQPkgLangList.moc
[ 25%] Generating YQPkgList.moc
[ 26%] Generating YQPkgObjList.moc
[ 28%] Generating YQPkgPackageKitGroupsFilterView.moc
[ 29%] Generating YQPkgPatchFilterView.moc
[ 30%] Generating YQPkgPatchList.moc
[ 32%] Generating YQPkgPatternList.moc
[ 33%] Generating YQPkgProductDialog.moc
[ 34%] Generating YQPkgProductList.moc
[ 35%] Generating YQPkgRepoFilterView.moc
[ 37%] Generating YQPkgRepoList.moc
[ 38%] Generating YQPkgRpmGroupTagsFilterView.moc
[ 39%] Generating YQPkgSearchFilterView.moc
[ 41%] Generating YQPkgSelDescriptionView.moc
[ 42%] Generating YQPkgStatusFilterView.moc
[ 43%] Generating YQPkgTechnicalDetailsView.moc
[ 44%] Generating YQPkgTextDialog.moc
[ 46%] Generating YQPkgUpdateProblemFilterView.moc
Scanning dependencies of target yui-qt-pkg
[ 47%] Building CXX object src/CMakeFiles/yui-qt-pkg.dir/QY2LayoutUtils.cc.o
[ 48%] Building CXX object src/CMakeFiles/yui-qt-pkg.dir/YQIconPool.cc.o
[ 50%] Building CXX object
src/CMakeFiles/yui-qt-pkg.dir/YQPackageSelectorBase.cc.o
[ 51%] Building CXX object src/CMakeFiles/yui-qt-pkg.dir/YQPackageSelector.cc.o
[ 52%] Building CXX object
src/CMakeFiles/yui-qt-pkg.dir/YQPackageSelectorHelp.cc.o
[ 53%] Building CXX object src/CMakeFiles/yui-qt-pkg.dir/YQPatternSelector.cc.o
[ 55%] Building CXX object
src/CMakeFiles/yui-qt-pkg.dir/YQSimplePatchSelector.cc.o
[ 56%] Building CXX object src/CMakeFiles/yui-qt-pkg.dir/YQPkgChangeLogView.cc.o
[ 57%] Building CXX object src/CMakeFiles/yui-qt-pkg.dir/YQPkgChangesDialog.cc.o
[ 58%] Building CXX object
src/CMakeFiles/yui-qt-pkg.dir/YQPkgConflictDialog.cc.o
[ 60%] Building CXX object src/CMakeFiles/yui-qt-pkg.dir/YQPkgConflictList.cc.o
[ 61%] Building CXX object
src/CMakeFiles/yui-qt-pkg.dir/YQPkgDependenciesView.cc.o
[ 62%] Building CXX object
src/CMakeFiles/yui-qt-pkg.dir/YQPkgDescriptionDialog.cc.o
[ 64%] Building CXX object
src/CMakeFiles/yui-qt-pkg.dir/YQPkgDescriptionView.cc.o
<http://river.suse.de/job/libyui-qt-pkg-HEAD/ws/checkout/src/YQPkgDescriptionView.cc>:
In member function 'QString YQPkgDescriptionView::findDesktopIcon(const
QString&) const':
<http://river.suse.de/job/libyui-qt-pkg-HEAD/ws/checkout/src/YQPkgDescriptionView.cc>:276:48:
error: unable to find string literal operator 'operator"" ICONSIZE'
<http://river.suse.de/job/libyui-qt-pkg-HEAD/ws/checkout/src/YQPkgDescriptionView.cc>:276:95:
error: unable to find string literal operator 'operator"" ICONSIZE'
<http://river.suse.de/job/libyui-qt-pkg-HEAD/ws/checkout/src/YQPkgDescriptionView.cc>:276:141:
error: unable to find string literal operator 'operator"" ICONSIZE'
<http://river.suse.de/job/libyui-qt-pkg-HEAD/ws/checkout/src/YQPkgDescriptionView.cc>:276:186:
error: unable to find string literal operator 'operator"" ICONSIZE'
<http://river.suse.de/job/libyui-qt-pkg-HEAD/ws/checkout/src/YQPkgDescriptionView.cc>:276:231:
error: unable to find string literal operator 'operator"" ICONSIZE'
<http://river.suse.de/job/libyui-qt-pkg-HEAD/ws/checkout/src/YQPkgDescriptionView.cc>:276:283:
error: unable to find string literal operator 'operator"" ICONSIZE'
ICECC[28187] 16:38:34: Compiled on 10.11.0.47
make[2]: *** [src/CMakeFiles/yui-qt-pkg.dir/YQPkgDescriptionView.cc.o] Error 1
make[1]: *** [src/CMakeFiles/yui-qt-pkg.dir/all] Error 2
make: *** [all] Error 2
++ error_exit 2
++ echo 'ERROR: detected exitcode 2'
ERROR: detected exitcode 2
++ cleanup
++ echo '==> Running cleanup'
==> Running cleanup
++ rm -f
<http://river.suse.de/job/libyui-qt-pkg-HEAD/ws/ICECC/113a946f1f881e1c8471fd19560edb17.tar.gz>
++ footer_and_exit 1
++ '[' -z 1 ']'
++ MYEXIT=1
++ '[' 1 == 0 ']'
++ ascii_failed
++ cat

( )
( ) (
) _ )
( \_
_(_\ \)__
(____\___))

build failed

++ exit 1
Build step 'Execute shell' marked build as failure
Archiving artifacts
--
To unsubscribe, e-mail: libyui-devel+unsubscribe@xxxxxxxxxxxx
To contact the owner, e-mail: libyui-devel+owner@xxxxxxxxxxxx

< Previous Next >
List Navigation
Follow Ups