Mailinglist Archive: libyui-devel (66 mails)

< Previous Next >
[libyui-devel] Build failed in Jenkins: libyui-ncurses-HEAD #71
  • From: hudson@xxxxxxx
  • Date: Wed, 27 Jun 2012 15:06:52 +0200 (CEST)
  • Message-id: <966033330.480.1340802412140.JavaMail.jenkins@river>
See <http://river.suse.de/job/libyui-ncurses-HEAD/71/>

------------------------------------------
[...truncated 35 lines...]
++ ALLOW_OBS_SUBMIT=yes
+ . .hudson-scripts/setup-buildenvironment
++ export RUNTESTS=1
++ RUNTESTS=1
++ export ICEJOBS=4
++ ICEJOBS=4
++ export CMAKE_INSTALL_PREFIX=/usr
++ CMAKE_INSTALL_PREFIX=/usr
+++ uname -m
+++ hostname -f
++ export 'CMAKEPARAS=-DBUILDNAME=x86_64 -DSITE=app5
-DCMAKE_INSTALL_PREFIX=/usr'
++ CMAKEPARAS='-DBUILDNAME=x86_64 -DSITE=app5 -DCMAKE_INSTALL_PREFIX=/usr'
++ export ICECCDIR=<http://river.suse.de/job/libyui-ncurses-HEAD/ws/ICECC>
++ ICECCDIR=<http://river.suse.de/job/libyui-ncurses-HEAD/ws/ICECC>
++ echo 'Configuring cmake for Icecream ...'
Configuring cmake for Icecream ...
++ rm -rf <http://river.suse.de/job/libyui-ncurses-HEAD/ws/ICECC>
++ mkdir -p <http://river.suse.de/job/libyui-ncurses-HEAD/ws/ICECC>
++ pushd <http://river.suse.de/job/libyui-ncurses-HEAD/ws/ICECC>
~/hudson/workspace/libyui-ncurses-HEAD/ICECC
~/hudson/workspace/libyui-ncurses-HEAD
+++ icecc --build-native
+++ tail -1
+++ grep .tar.gz
+++ sed -e 's/creating //'
loader cannot load itself
ldd: exited with unknown exit code (127)
++ export ICECC_ENV=113a946f1f881e1c8471fd19560edb17.tar.gz
++ ICECC_ENV=113a946f1f881e1c8471fd19560edb17.tar.gz
++ export ICECC_ENV=113a946f1f881e1c8471fd19560edb17.tar.gz
++ ICECC_ENV=113a946f1f881e1c8471fd19560edb17.tar.gz
++ export
ICECC_VERSION=<http://river.suse.de/job/libyui-ncurses-HEAD/ws/ICECC/113a946f1f881e1c8471fd19560edb17.tar.gz>
++
ICECC_VERSION=<http://river.suse.de/job/libyui-ncurses-HEAD/ws/ICECC/113a946f1f881e1c8471fd19560edb17.tar.gz>
++ popd
~/hudson/workspace/libyui-ncurses-HEAD
++ pushd <http://river.suse.de/job/libyui-ncurses-HEAD/ws/>
~/hudson/workspace/libyui-ncurses-HEAD ~/hudson/workspace/libyui-ncurses-HEAD
++ export ICECREAM=-DCMAKE_CXX_COMPILER=/opt/icecream/bin/g++
++ ICECREAM=-DCMAKE_CXX_COMPILER=/opt/icecream/bin/g++
++ export CXX=/opt/icecream/bin/g++
++ CXX=/opt/icecream/bin/g++
++ export 'MAKECMD=make -j 4'
++ MAKECMD='make -j 4'
++ export MAKEBIN=make
++ MAKEBIN=make
++ export
PATH=/opt/icecream/bin:/sbin:/usr/sbin:/usr/local/sbin:/root/bin:/usr/local/bin:/usr/bin:/bin:/usr/X11R6/bin:/usr/games
++
PATH=/opt/icecream/bin:/sbin:/usr/sbin:/usr/local/sbin:/root/bin:/usr/local/bin:/usr/bin:/bin:/usr/X11R6/bin:/usr/games
++ popd
~/hudson/workspace/libyui-ncurses-HEAD
++ export CHECKOUTDIR=<http://river.suse.de/job/libyui-ncurses-HEAD/ws/checkout>
++ CHECKOUTDIR=<http://river.suse.de/job/libyui-ncurses-HEAD/ws/checkout>
++ export BUILDDIR=<http://river.suse.de/job/libyui-ncurses-HEAD/ws/build>
++ BUILDDIR=<http://river.suse.de/job/libyui-ncurses-HEAD/ws/build>
++ export
PACKAGEDIR=<http://river.suse.de/job/libyui-ncurses-HEAD/ws/build/package>
++ PACKAGEDIR=<http://river.suse.de/job/libyui-ncurses-HEAD/ws/build/package>
++ export
ARTIFACTS=<http://river.suse.de/job/libyui-ncurses-HEAD/71/artifact/.artifacts>
++
ARTIFACTS=<http://river.suse.de/job/libyui-ncurses-HEAD/71/artifact/.artifacts>
++ export OBSDIR=<http://river.suse.de/job/libyui-ncurses-HEAD/ws/OBS>
++ OBSDIR=<http://river.suse.de/job/libyui-ncurses-HEAD/ws/OBS>
++ export RPMTOPDIR=<http://river.suse.de/job/libyui-ncurses-HEAD/ws/rpm>
++ RPMTOPDIR=<http://river.suse.de/job/libyui-ncurses-HEAD/ws/rpm>
++ export RPMOUT=<http://river.suse.de/job/libyui-ncurses-HEAD/ws/rpm/rpms>
++ RPMOUT=<http://river.suse.de/job/libyui-ncurses-HEAD/ws/rpm/rpms>
++ export
RPMBUILDDIR=<http://river.suse.de/job/libyui-ncurses-HEAD/ws/rpm/rpmbuild>
++ RPMBUILDDIR=<http://river.suse.de/job/libyui-ncurses-HEAD/ws/rpm/rpmbuild>
++ export
RPMBUILDROOT=<http://river.suse.de/job/libyui-ncurses-HEAD/ws/rpm/rpmbuildroot>
++
RPMBUILDROOT=<http://river.suse.de/job/libyui-ncurses-HEAD/ws/rpm/rpmbuildroot>
++ rm -rf <http://river.suse.de/job/libyui-ncurses-HEAD/ws/rpm/rpms>
++ rm -rf <http://river.suse.de/job/libyui-ncurses-HEAD/ws/rpm/rpmbuild>
++ rm -rf <http://river.suse.de/job/libyui-ncurses-HEAD/ws/rpm/rpmbuildroot>
++ rm -rf <http://river.suse.de/job/libyui-ncurses-HEAD/71/artifact/.artifacts>
++ rm -rf <http://river.suse.de/job/libyui-ncurses-HEAD/ws/OBS>
++ rm -rf '<http://river.suse.de/job/libyui-ncurses-HEAD/ws/copy-to-slave*.dir'>
++ [[ '' == 1 ]]
++ rm -rf <http://river.suse.de/job/libyui-ncurses-HEAD/ws/build>
++ mkdir -p <http://river.suse.de/job/libyui-ncurses-HEAD/ws/build>
++ mkdir -p <http://river.suse.de/job/libyui-ncurses-HEAD/ws/rpm>
++ mkdir -p <http://river.suse.de/job/libyui-ncurses-HEAD/ws/rpm/rpms>
++ mkdir -p <http://river.suse.de/job/libyui-ncurses-HEAD/ws/rpm/rpmbuild>
++ mkdir -p <http://river.suse.de/job/libyui-ncurses-HEAD/ws/rpm/rpmbuildroot>
++ mkdir -p
<http://river.suse.de/job/libyui-ncurses-HEAD/71/artifact/.artifacts>
++ mkdir -p <http://river.suse.de/job/libyui-ncurses-HEAD/ws/OBS>
++ cat
+ test -d <http://river.suse.de/job/libyui-ncurses-HEAD/ws/build/package>
+ mkdir -p <http://river.suse.de/job/libyui-ncurses-HEAD/ws/build/package>
+ cd <http://river.suse.de/job/libyui-ncurses-HEAD/ws/checkout>
+ make -f Makefile.cvs
rm -rf build
mkdir build ; \
cd build ; \
cmake -DCMAKE_BUILD_TYPE=RELEASE ..
-- The C compiler identification is GNU 4.7.0
-- The CXX compiler identification is GNU 4.7.0
-- Check for working C compiler: /opt/icecream/bin/gcc
-- Check for working C compiler: /opt/icecream/bin/gcc -- works
-- Detecting C compiler ABI info
-- Detecting C compiler ABI info - done
-- Check for working CXX compiler: /opt/icecream/bin/g++
-- Check for working CXX compiler: /opt/icecream/bin/g++ -- works
-- Detecting CXX compiler ABI info
-- Detecting CXX compiler ABI info - done
-- USE_C_STD not set, defaulting to gnu99
-- Found Doxygen: /usr/bin/doxygen (found version "1.7.6.1")
-- Found Dot: /usr/bin/dot
-- Checking for LaTeX: not found
-- Found Curses6:
/usr/lib64/ncurses6/libncursesw.so;/usr/lib64/ncurses6/libpanelw.so
-- Found Libyui: (Version: 2.42.0)
--
--
********************************************************************************
--
-- libyui-ncurses has been configured with following options:
--
-- Plugin-Name: ncurses
-- Library-Dependencies: Curses6;Libyui
-- Plugin is for use with:
-- targetlib to build: yui-ncurses
--
-- Version: 2.42.0
-- SO-Version: 4.0.0
--
-- Used Build-Option: RELEASE
-- Used Compiler-Flags: -fmessage-length=0 -Wall -Werror
-O3
-- linking against:
-- using includes from:
/usr/include/yui;/usr/include/ncurses6
--
--
-- Install to Prefix: /usr
-- use Shared-Dir: /usr/share
-- use Library-Dir: /usr/lib64/yui
-- use Include-Dir: /usr/include/yui/ncurses
-- use CMake Plugin-InstallDir: /usr/lib64/cmake/libyui-ncurses
-- use Doc-Dir: /usr/share/doc/libyui-ncurses
-- Data-Dir: /usr/share/libyui
-- Theme-Dir: /usr/share/libyui/theme
--
-- Disable shared library: OFF
-- Include Debug-Symbols in library: OFF
-- Build a static library, too: OFF
-- Build the examples, too: OFF
--
--
********************************************************************************
--
-- Configuring done
-- Generating done
-- Build files have been written to:
<http://river.suse.de/job/libyui-ncurses-HEAD/ws/checkout/build>
+ cd build
+ make clean
+ make
Scanning dependencies of target yui-ncurses
[ 1%] Building CXX object src/CMakeFiles/yui-ncurses.dir/position.cc.o
[ 3%] Building CXX object src/CMakeFiles/yui-ncurses.dir/YNCursesUI.cc.o
In file included from
<http://river.suse.de/job/libyui-ncurses-HEAD/ws/checkout/src/YNCursesUI.h>:32:0,
from
<http://river.suse.de/job/libyui-ncurses-HEAD/ws/checkout/src/YNCursesUI.cc>:25:
<http://river.suse.de/job/libyui-ncurses-HEAD/ws/checkout/src/NCApplication.h>:62:37:
error: 'string' does not name a type
<http://river.suse.de/job/libyui-ncurses-HEAD/ws/checkout/src/NCApplication.h>:62:46:
error: ISO C++ forbids declaration of 'language' with no type [-fpermissive]
<http://river.suse.de/job/libyui-ncurses-HEAD/ws/checkout/src/NCApplication.h>:63:16:
error: 'string' does not name a type
<http://river.suse.de/job/libyui-ncurses-HEAD/ws/checkout/src/NCApplication.h>:63:43:
error: ISO C++ forbids declaration of 'encoding' with no type [-fpermissive]
In file included from
<http://river.suse.de/job/libyui-ncurses-HEAD/ws/checkout/src/YNCursesUI.h>:32:0,
from
<http://river.suse.de/job/libyui-ncurses-HEAD/ws/checkout/src/YNCursesUI.cc>:25:
<http://river.suse.de/job/libyui-ncurses-HEAD/ws/checkout/src/NCApplication.h>:79:13:
error: 'string' does not name a type
In file included from
<http://river.suse.de/job/libyui-ncurses-HEAD/ws/checkout/src/YNCursesUI.h>:32:0,
from
<http://river.suse.de/job/libyui-ncurses-HEAD/ws/checkout/src/YNCursesUI.cc>:25:
<http://river.suse.de/job/libyui-ncurses-HEAD/ws/checkout/src/NCApplication.h>:98:13:
error: 'string' does not name a type
In file included from
<http://river.suse.de/job/libyui-ncurses-HEAD/ws/checkout/src/YNCursesUI.h>:32:0,
from
<http://river.suse.de/job/libyui-ncurses-HEAD/ws/checkout/src/YNCursesUI.cc>:25:
<http://river.suse.de/job/libyui-ncurses-HEAD/ws/checkout/src/NCApplication.h>:120:13:
error: 'string' does not name a type
<http://river.suse.de/job/libyui-ncurses-HEAD/ws/checkout/src/NCApplication.h>:151:40:
error: 'string' does not name a type
<http://river.suse.de/job/libyui-ncurses-HEAD/ws/checkout/src/NCApplication.h>:151:49:
error: ISO C++ forbids declaration of 'console_magic' with no type
[-fpermissive]
<http://river.suse.de/job/libyui-ncurses-HEAD/ws/checkout/src/NCApplication.h>:152:12:
error: 'string' does not name a type
<http://river.suse.de/job/libyui-ncurses-HEAD/ws/checkout/src/NCApplication.h>:152:21:
error: ISO C++ forbids declaration of 'font' with no type [-fpermissive]
<http://river.suse.de/job/libyui-ncurses-HEAD/ws/checkout/src/NCApplication.h>:153:12:
error: 'string' does not name a type
<http://river.suse.de/job/libyui-ncurses-HEAD/ws/checkout/src/NCApplication.h>:153:21:
error: ISO C++ forbids declaration of 'screen_map' with no type [-fpermissive]
<http://river.suse.de/job/libyui-ncurses-HEAD/ws/checkout/src/NCApplication.h>:154:12:
error: 'string' does not name a type
<http://river.suse.de/job/libyui-ncurses-HEAD/ws/checkout/src/NCApplication.h>:154:21:
error: ISO C++ forbids declaration of 'unicode_map' with no type [-fpermissive]
<http://river.suse.de/job/libyui-ncurses-HEAD/ws/checkout/src/NCApplication.h>:155:12:
error: 'string' does not name a type
<http://river.suse.de/job/libyui-ncurses-HEAD/ws/checkout/src/NCApplication.h>:155:21:
error: ISO C++ forbids declaration of 'language' with no type [-fpermissive]
In file included from
<http://river.suse.de/job/libyui-ncurses-HEAD/ws/checkout/src/YNCursesUI.h>:32:0,
from
<http://river.suse.de/job/libyui-ncurses-HEAD/ws/checkout/src/YNCursesUI.cc>:25:
<http://river.suse.de/job/libyui-ncurses-HEAD/ws/checkout/src/NCApplication.h>:168:38:
error: 'string' does not name a type
<http://river.suse.de/job/libyui-ncurses-HEAD/ws/checkout/src/NCApplication.h>:168:47:
error: ISO C++ forbids declaration of 'command' with no type [-fpermissive]
In file included from
<http://river.suse.de/job/libyui-ncurses-HEAD/ws/checkout/src/YNCursesUI.h>:32:0,
from
<http://river.suse.de/job/libyui-ncurses-HEAD/ws/checkout/src/YNCursesUI.cc>:25:
<http://river.suse.de/job/libyui-ncurses-HEAD/ws/checkout/src/NCApplication.h>:63:43:
error: 'string' was not declared in this scope
<http://river.suse.de/job/libyui-ncurses-HEAD/ws/checkout/src/NCApplication.h>:63:43:
note: suggested alternative:
In file included from /usr/include/c++/4.7/iosfwd:41:0,
from
<http://river.suse.de/job/libyui-ncurses-HEAD/ws/checkout/src/YNCursesUI.h>:29,
from
<http://river.suse.de/job/libyui-ncurses-HEAD/ws/checkout/src/YNCursesUI.cc>:25:
/usr/include/c++/4.7/bits/stringfwd.h:65:30: note: 'std::string'
In file included from
<http://river.suse.de/job/libyui-ncurses-HEAD/ws/checkout/src/YNCursesUI.cc>:25:0:
<http://river.suse.de/job/libyui-ncurses-HEAD/ws/checkout/src/YNCursesUI.h>:105:40:
error: 'string' does not name a type
<http://river.suse.de/job/libyui-ncurses-HEAD/ws/checkout/src/YNCursesUI.h>:105:49:
error: ISO C++ forbids declaration of 'console_magic' with no type
[-fpermissive]
<http://river.suse.de/job/libyui-ncurses-HEAD/ws/checkout/src/YNCursesUI.h>:106:12:
error: 'string' does not name a type
<http://river.suse.de/job/libyui-ncurses-HEAD/ws/checkout/src/YNCursesUI.h>:106:21:
error: ISO C++ forbids declaration of 'font' with no type [-fpermissive]
<http://river.suse.de/job/libyui-ncurses-HEAD/ws/checkout/src/YNCursesUI.h>:107:12:
error: 'string' does not name a type
<http://river.suse.de/job/libyui-ncurses-HEAD/ws/checkout/src/YNCursesUI.h>:107:21:
error: ISO C++ forbids declaration of 'screen_map' with no type [-fpermissive]
<http://river.suse.de/job/libyui-ncurses-HEAD/ws/checkout/src/YNCursesUI.h>:108:12:
error: 'string' does not name a type
<http://river.suse.de/job/libyui-ncurses-HEAD/ws/checkout/src/YNCursesUI.h>:108:21:
error: ISO C++ forbids declaration of 'unicode_map' with no type [-fpermissive]
<http://river.suse.de/job/libyui-ncurses-HEAD/ws/checkout/src/YNCursesUI.h>:109:12:
error: 'string' does not name a type
<http://river.suse.de/job/libyui-ncurses-HEAD/ws/checkout/src/YNCursesUI.h>:109:21:
error: ISO C++ forbids declaration of 'lang' with no type [-fpermissive]
<http://river.suse.de/job/libyui-ncurses-HEAD/ws/checkout/src/YNCursesUI.cc>:
In member function 'virtual YApplication* YNCursesUI::createApplication()':
<http://river.suse.de/job/libyui-ncurses-HEAD/ws/checkout/src/YNCursesUI.cc>:140:45:
error: cannot allocate an object of abstract type 'NCApplication'
In file included from
<http://river.suse.de/job/libyui-ncurses-HEAD/ws/checkout/src/YNCursesUI.h>:32:0,
from
<http://river.suse.de/job/libyui-ncurses-HEAD/ws/checkout/src/YNCursesUI.cc>:25:
<http://river.suse.de/job/libyui-ncurses-HEAD/ws/checkout/src/NCApplication.h>:31:7:
note: because the following virtual functions are pure within
'NCApplication':
In file included from
<http://river.suse.de/job/libyui-ncurses-HEAD/ws/checkout/src/NCApplication.h>:28:0,
from
<http://river.suse.de/job/libyui-ncurses-HEAD/ws/checkout/src/YNCursesUI.h>:32,
from
<http://river.suse.de/job/libyui-ncurses-HEAD/ws/checkout/src/YNCursesUI.cc>:25:
/usr/include/yui/YApplication.h:181:25: note: virtual std::string
YApplication::askForExistingDirectory(const string&, const string&)
In file included from
<http://river.suse.de/job/libyui-ncurses-HEAD/ws/checkout/src/NCApplication.h>:28:0,
from
<http://river.suse.de/job/libyui-ncurses-HEAD/ws/checkout/src/YNCursesUI.h>:32,
from
<http://river.suse.de/job/libyui-ncurses-HEAD/ws/checkout/src/YNCursesUI.cc>:25:
/usr/include/yui/YApplication.h:200:25: note: virtual std::string
YApplication::askForExistingFile(const string&, const string&, const string&)
In file included from
<http://river.suse.de/job/libyui-ncurses-HEAD/ws/checkout/src/NCApplication.h>:28:0,
from
<http://river.suse.de/job/libyui-ncurses-HEAD/ws/checkout/src/YNCursesUI.h>:32,
from
<http://river.suse.de/job/libyui-ncurses-HEAD/ws/checkout/src/YNCursesUI.cc>:25:
/usr/include/yui/YApplication.h:222:25: note: virtual std::string
YApplication::askForSaveFileName(const string&, const string&, const string&)
<http://river.suse.de/job/libyui-ncurses-HEAD/ws/checkout/src/YNCursesUI.cc>:
At global scope:
<http://river.suse.de/job/libyui-ncurses-HEAD/ws/checkout/src/YNCursesUI.cc>:337:6:
error: prototype for 'void YNCursesUI::setConsoleFont(const string&, const
string&, const string&, const string&, const string&)' does not match any in
class 'YNCursesUI'
In file included from
<http://river.suse.de/job/libyui-ncurses-HEAD/ws/checkout/src/YNCursesUI.cc>:25:0:
<http://river.suse.de/job/libyui-ncurses-HEAD/ws/checkout/src/YNCursesUI.h>:105:18:
error: candidate is: virtual void YNCursesUI::setConsoleFont(const int&, const
int&, const int&, const int&, const int&)
ICECC[24918] 15:35:21: Compiled on 10.11.0.175
make[2]: *** [src/CMakeFiles/yui-ncurses.dir/YNCursesUI.cc.o] Error 1
make[1]: *** [src/CMakeFiles/yui-ncurses.dir/all] Error 2
make: *** [all] Error 2
++ error_exit 2
++ echo 'ERROR: detected exitcode 2'
ERROR: detected exitcode 2
++ cleanup
++ echo '==> Running cleanup'
==> Running cleanup
++ rm -f
<http://river.suse.de/job/libyui-ncurses-HEAD/ws/ICECC/113a946f1f881e1c8471fd19560edb17.tar.gz>
++ footer_and_exit 1
++ '[' -z 1 ']'
++ MYEXIT=1
++ '[' 1 == 0 ']'
++ ascii_failed
++ cat

( )
( ) (
) _ )
( \_
_(_\ \)__
(____\___))

build failed

++ exit 1
Build step 'Execute shell' marked build as failure
Archiving artifacts
--
To unsubscribe, e-mail: libyui-devel+unsubscribe@xxxxxxxxxxxx
To contact the owner, e-mail: libyui-devel+owner@xxxxxxxxxxxx

< Previous Next >
This Thread
Follow Ups