Mailinglist Archive: libyui-devel (69 mails)

< Previous Next >
[libyui-devel] Build failed in Jenkins: libyui-gtk-HEAD #64
  • From: hudson@xxxxxxx
  • Date: Tue, 26 Jun 2012 17:43:18 +0200 (CEST)
  • Message-id: <1292479760.399.1340725398086.JavaMail.jenkins@river>
See <http://river.suse.de/job/libyui-gtk-HEAD/64/>

------------------------------------------
Started by upstream project "libyui-HEAD" build number 55
Building remotely on node-zyppHEAD in workspace
<http://river.suse.de/job/libyui-gtk-HEAD/ws/>
Checkout:libyui-gtk-HEAD / <http://river.suse.de/job/libyui-gtk-HEAD/ws/> -
hudson.remoting.Channel@11948f9:node-zyppHEAD
Using strategy: Default
Last Built Revision: Revision 923d9876979d1b2b5f5683e888f35e5b142195a1
(origin/master)
Checkout:checkout / <http://river.suse.de/job/libyui-gtk-HEAD/ws/checkout> -
hudson.remoting.LocalChannel@3a73a8c
Fetching changes from the remote Git repository
Fetching upstream changes from https://github.com/libyui/libyui-gtk.git
Commencing build of Revision 923d9876979d1b2b5f5683e888f35e5b142195a1
(origin/master)
Checking out Revision 923d9876979d1b2b5f5683e888f35e5b142195a1 (origin/master)
[copy-to-slave] Copying '.hudson-scripts/**', excluding nothing, from
'file:/var/lib/jenkins/userContent/' on the master to
'<http://river.suse.de/job/libyui-gtk-HEAD/ws/'> on 'node-zyppHEAD'.
[libyui-gtk-HEAD] $ /bin/sh -xe /tmp/hudson6159993879834303482.sh
+ echo '### BUILD ###'
### BUILD ###
+ echo '==> Reading build configuration'
==> Reading build configuration
+ . .hudson-scripts/base-functions
++ . .hudson-scripts/ascii_art
++ trap 'error_exit $?' ERR
++ echo 'Job running as user: root'
Job running as user: root
+++ date '+%F %T'
++ echo 'Started at: 2012-06-26 18:12:19'
Started at: 2012-06-26 18:12:19
+++ hostname --fqdn
++ export SITENAME=app5
++ SITENAME=app5
++ export TARGET_DIST=HEAD
++ TARGET_DIST=HEAD
++ export PROJECT=libyui-gtk
++ PROJECT=libyui-gtk
+ . .hudson-scripts/build-functions
+ . .hudson-scripts/obs-functions
++ trap 'error_exit $?' ERR
++ export ALLOW_OBS_SUBMIT=yes
++ ALLOW_OBS_SUBMIT=yes
+ . .hudson-scripts/setup-buildenvironment
++ export RUNTESTS=1
++ RUNTESTS=1
++ export ICEJOBS=4
++ ICEJOBS=4
++ export CMAKE_INSTALL_PREFIX=/usr
++ CMAKE_INSTALL_PREFIX=/usr
+++ uname -m
+++ hostname -f
++ export 'CMAKEPARAS=-DBUILDNAME=x86_64 -DSITE=app5
-DCMAKE_INSTALL_PREFIX=/usr'
++ CMAKEPARAS='-DBUILDNAME=x86_64 -DSITE=app5 -DCMAKE_INSTALL_PREFIX=/usr'
++ export ICECCDIR=<http://river.suse.de/job/libyui-gtk-HEAD/ws/ICECC>
++ ICECCDIR=<http://river.suse.de/job/libyui-gtk-HEAD/ws/ICECC>
++ echo 'Configuring cmake for Icecream ...'
Configuring cmake for Icecream ...
++ rm -rf <http://river.suse.de/job/libyui-gtk-HEAD/ws/ICECC>
++ mkdir -p <http://river.suse.de/job/libyui-gtk-HEAD/ws/ICECC>
++ pushd <http://river.suse.de/job/libyui-gtk-HEAD/ws/ICECC>
~/hudson/workspace/libyui-gtk-HEAD/ICECC ~/hudson/workspace/libyui-gtk-HEAD
+++ icecc --build-native
+++ sed -e 's/creating //'
+++ grep .tar.gz
+++ tail -1
loader cannot load itself
ldd: exited with unknown exit code (127)
++ export ICECC_ENV=113a946f1f881e1c8471fd19560edb17.tar.gz
++ ICECC_ENV=113a946f1f881e1c8471fd19560edb17.tar.gz
++ export ICECC_ENV=113a946f1f881e1c8471fd19560edb17.tar.gz
++ ICECC_ENV=113a946f1f881e1c8471fd19560edb17.tar.gz
++ export
ICECC_VERSION=<http://river.suse.de/job/libyui-gtk-HEAD/ws/ICECC/113a946f1f881e1c8471fd19560edb17.tar.gz>
++
ICECC_VERSION=<http://river.suse.de/job/libyui-gtk-HEAD/ws/ICECC/113a946f1f881e1c8471fd19560edb17.tar.gz>
++ popd
~/hudson/workspace/libyui-gtk-HEAD
++ pushd <http://river.suse.de/job/libyui-gtk-HEAD/ws/>
~/hudson/workspace/libyui-gtk-HEAD ~/hudson/workspace/libyui-gtk-HEAD
++ export ICECREAM=-DCMAKE_CXX_COMPILER=/opt/icecream/bin/g++
++ ICECREAM=-DCMAKE_CXX_COMPILER=/opt/icecream/bin/g++
++ export CXX=/opt/icecream/bin/g++
++ CXX=/opt/icecream/bin/g++
++ export 'MAKECMD=make -j 4'
++ MAKECMD='make -j 4'
++ export MAKEBIN=make
++ MAKEBIN=make
++ export
PATH=/opt/icecream/bin:/sbin:/usr/sbin:/usr/local/sbin:/root/bin:/usr/local/bin:/usr/bin:/bin:/usr/X11R6/bin:/usr/games
++
PATH=/opt/icecream/bin:/sbin:/usr/sbin:/usr/local/sbin:/root/bin:/usr/local/bin:/usr/bin:/bin:/usr/X11R6/bin:/usr/games
++ popd
~/hudson/workspace/libyui-gtk-HEAD
++ export CHECKOUTDIR=<http://river.suse.de/job/libyui-gtk-HEAD/ws/checkout>
++ CHECKOUTDIR=<http://river.suse.de/job/libyui-gtk-HEAD/ws/checkout>
++ export BUILDDIR=<http://river.suse.de/job/libyui-gtk-HEAD/ws/build>
++ BUILDDIR=<http://river.suse.de/job/libyui-gtk-HEAD/ws/build>
++ export PACKAGEDIR=<http://river.suse.de/job/libyui-gtk-HEAD/ws/build/package>
++ PACKAGEDIR=<http://river.suse.de/job/libyui-gtk-HEAD/ws/build/package>
++ export
ARTIFACTS=<http://river.suse.de/job/libyui-gtk-HEAD/64/artifact/.artifacts>
++ ARTIFACTS=<http://river.suse.de/job/libyui-gtk-HEAD/64/artifact/.artifacts>
++ export OBSDIR=<http://river.suse.de/job/libyui-gtk-HEAD/ws/OBS>
++ OBSDIR=<http://river.suse.de/job/libyui-gtk-HEAD/ws/OBS>
++ export RPMTOPDIR=<http://river.suse.de/job/libyui-gtk-HEAD/ws/rpm>
++ RPMTOPDIR=<http://river.suse.de/job/libyui-gtk-HEAD/ws/rpm>
++ export RPMOUT=<http://river.suse.de/job/libyui-gtk-HEAD/ws/rpm/rpms>
++ RPMOUT=<http://river.suse.de/job/libyui-gtk-HEAD/ws/rpm/rpms>
++ export RPMBUILDDIR=<http://river.suse.de/job/libyui-gtk-HEAD/ws/rpm/rpmbuild>
++ RPMBUILDDIR=<http://river.suse.de/job/libyui-gtk-HEAD/ws/rpm/rpmbuild>
++ export
RPMBUILDROOT=<http://river.suse.de/job/libyui-gtk-HEAD/ws/rpm/rpmbuildroot>
++ RPMBUILDROOT=<http://river.suse.de/job/libyui-gtk-HEAD/ws/rpm/rpmbuildroot>
++ rm -rf <http://river.suse.de/job/libyui-gtk-HEAD/ws/rpm/rpms>
++ rm -rf <http://river.suse.de/job/libyui-gtk-HEAD/ws/rpm/rpmbuild>
++ rm -rf <http://river.suse.de/job/libyui-gtk-HEAD/ws/rpm/rpmbuildroot>
++ rm -rf <http://river.suse.de/job/libyui-gtk-HEAD/64/artifact/.artifacts>
++ rm -rf <http://river.suse.de/job/libyui-gtk-HEAD/ws/OBS>
++ rm -rf '<http://river.suse.de/job/libyui-gtk-HEAD/ws/copy-to-slave*.dir'>
++ [[ '' == 1 ]]
++ rm -rf <http://river.suse.de/job/libyui-gtk-HEAD/ws/build>
++ mkdir -p <http://river.suse.de/job/libyui-gtk-HEAD/ws/build>
++ mkdir -p <http://river.suse.de/job/libyui-gtk-HEAD/ws/rpm>
++ mkdir -p <http://river.suse.de/job/libyui-gtk-HEAD/ws/rpm/rpms>
++ mkdir -p <http://river.suse.de/job/libyui-gtk-HEAD/ws/rpm/rpmbuild>
++ mkdir -p <http://river.suse.de/job/libyui-gtk-HEAD/ws/rpm/rpmbuildroot>
++ mkdir -p <http://river.suse.de/job/libyui-gtk-HEAD/64/artifact/.artifacts>
++ mkdir -p <http://river.suse.de/job/libyui-gtk-HEAD/ws/OBS>
++ cat
+ test -d <http://river.suse.de/job/libyui-gtk-HEAD/ws/build/package>
+ mkdir -p <http://river.suse.de/job/libyui-gtk-HEAD/ws/build/package>
+ cd <http://river.suse.de/job/libyui-gtk-HEAD/ws/checkout>
+ make -f Makefile.cvs
rm -rf build
mkdir build ; \
cd build ; \
cmake .. \
-DENABLE_WERROR=OFF \
-DCMAKE_BUILD_TYPE=RELEASE
-- The C compiler identification is GNU 4.7.0
-- The CXX compiler identification is GNU 4.7.0
-- Check for working C compiler: /opt/icecream/bin/gcc
-- Check for working C compiler: /opt/icecream/bin/gcc -- broken
CMake Error at /usr/share/cmake/Modules/CMakeTestCCompiler.cmake:52 (MESSAGE):
The C compiler "/opt/icecream/bin/gcc" is not able to compile a simple test
program.

It fails with the following output:

Change Dir:
<http://river.suse.de/job/libyui-gtk-HEAD/ws/checkout/build/CMakeFiles/CMakeTmp>



Run Build Command:/usr/bin/gmake "cmTryCompileExec3073334911/fast"

gmake[1]: Entering directory

`<http://river.suse.de/job/libyui-gtk-HEAD/ws/checkout/build/CMakeFiles/CMakeTmp'>


/usr/bin/gmake -f CMakeFiles/cmTryCompileExec3073334911.dir/build.make
CMakeFiles/cmTryCompileExec3073334911.dir/build

gmake[2]: Entering directory

`<http://river.suse.de/job/libyui-gtk-HEAD/ws/checkout/build/CMakeFiles/CMakeTmp'>


/usr/bin/cmake -E cmake_progress_report

<http://river.suse.de/job/libyui-gtk-HEAD/ws/checkout/build/CMakeFiles/CMakeTmp/CMakeFiles>
1

Building C object
CMakeFiles/cmTryCompileExec3073334911.dir/testCCompiler.c.o

/opt/icecream/bin/gcc -o
CMakeFiles/cmTryCompileExec3073334911.dir/testCCompiler.c.o -c

<http://river.suse.de/job/libyui-gtk-HEAD/ws/checkout/build/CMakeFiles/CMakeTmp/testCCompiler.c>


FATAL: kernel too old

ICECC[17205] 18:12:26: Compiled on 10.11.1.109

gmake[2]: Leaving directory

`<http://river.suse.de/job/libyui-gtk-HEAD/ws/checkout/build/CMakeFiles/CMakeTmp'>


gmake[2]: *** [CMakeFiles/cmTryCompileExec3073334911.dir/testCCompiler.c.o]
Error 1

gmake[1]: Leaving directory

`<http://river.suse.de/job/libyui-gtk-HEAD/ws/checkout/build/CMakeFiles/CMakeTmp'>


gmake[1]: *** [cmTryCompileExec3073334911/fast] Error 2





CMake will not be able to correctly generate this project.
Call Stack (most recent call first):
CMakeLists.txt:25 (PROJECT)


-- Configuring incomplete, errors occurred!
make: *** [configure] Error 1
++ error_exit 2
++ echo 'ERROR: detected exitcode 2'
ERROR: detected exitcode 2
++ cleanup
++ echo '==> Running cleanup'
==> Running cleanup
++ rm -f
<http://river.suse.de/job/libyui-gtk-HEAD/ws/ICECC/113a946f1f881e1c8471fd19560edb17.tar.gz>
++ footer_and_exit 1
++ '[' -z 1 ']'
++ MYEXIT=1
++ '[' 1 == 0 ']'
++ ascii_failed
++ cat

( )
( ) (
) _ )
( \_
_(_\ \)__
(____\___))

build failed

++ exit 1
Build step 'Execute shell' marked build as failure
Archiving artifacts
--
To unsubscribe, e-mail: libyui-devel+unsubscribe@xxxxxxxxxxxx
To contact the owner, e-mail: libyui-devel+owner@xxxxxxxxxxxx

< Previous Next >
This Thread
Follow Ups