Mailinglist Archive: libyui-commit (28 mails)

< Previous Next >
[libyui-commit] Build failed in Jenkins: libyui-qt-pkg-master #5
  • From: admin@xxxxxxxxxxxx
  • Date: Fri, 21 Feb 2014 18:04:56 +0100 (CET)
  • Message-id: <490741056.16.1393002296894.JavaMail.jenkins@ci-opensuse>
See <http://ci.opensuse.org/job/libyui-qt-pkg-master/5/>

------------------------------------------
[...truncated 677 lines...]
[ 10s] OK: linked to
/home/abuild/rpmbuild/BUILD/libyui-qt-pkg-2.44.0/./CMakeLists.txt.
[ 10s] + mkdir build
[ 10s] + cd build
[ 10s] + cmake .. -DPREFIX=/usr -DDOC_DIR=/usr/share/doc/packages
-DLIB_DIR=lib64 -DCMAKE_BUILD_TYPE=RELEASE
[ 10s] -- The C compiler identification is GNU 4.8.2
[ 10s] -- The CXX compiler identification is GNU 4.8.2
[ 10s] -- Check for working C compiler: /usr/bin/cc
[ 10s] -- Check for working C compiler: /usr/bin/cc -- works
[ 10s] -- Detecting C compiler ABI info
[ 11s] -- Detecting C compiler ABI info - done
[ 11s] -- Check for working CXX compiler: /usr/bin/c++
[ 11s] -- Check for working CXX compiler: /usr/bin/c++ -- works
[ 11s] -- Detecting CXX compiler ABI info
[ 11s] -- Detecting CXX compiler ABI info - done
[ 11s] -- ZYpp path not set. Looking for it.
[ 11s] -- ZYpp found: includes in /usr/include, library in
/usr/lib64/libzypp.so
[ 11s] -- Found Libyui: (Version: 3.0.13)
[ 11s] -- Found Libyui-qt: (Version: 2.45.0)
[ 11s] -- zypp found
[ 11s] -- USE_C_STD not set, defaulting to gnu99
[ 11s] -- Could NOT find Doxygen (missing: DOXYGEN_EXECUTABLE)
[ 11s] --
[ 11s] --
********************************************************************************
[ 11s] --
[ 11s] -- libyui-qt-pkg has been configured with following options:
[ 11s] --
[ 11s] -- Plugin-Name: qt-pkg
[ 11s] -- Extension-Name:
[ 11s] -- Library-Dependencies:
Qt5Core;Qt5Gui;Qt5Widgets;Zypp;Libyui;Libyui-qt
[ 11s] -- Plugin is for use with:
[ 11s] -- targetlib to build: yui-qt-pkg
[ 11s] --
[ 11s] -- Version: 2.44.0
[ 11s] -- SO-Version: 6.0.0
[ 11s] --
[ 11s] -- Used Build-Option: RELEASE
[ 11s] -- Used Compiler-Flags: -fmessage-length=0
-grecord-gcc-switches -O2 -Wall -D_FORTIFY_SOURCE=2 -fstack-protector
-funwind-tables -fasynchronous-unwind-tables -DNDEBUG -std=c++0x
-fmessage-length=0 -Wall -Werror -O3
[ 11s] -- linking against: zypp
[ 11s] -- using includes from:
/usr/include/yui/qt;/usr/include/yui/qt/..;/usr/include/yui;/usr/include/yui/..;/usr/include
[ 11s] --
[ 11s] --
[ 11s] -- Install to Prefix: /usr
[ 11s] -- use Shared-Dir: /usr/share
[ 11s] -- use Library-Dir: /usr/lib64/yui
[ 11s] -- use Include-Dir: /usr/include/yui/qt-pkg
[ 11s] -- use CMake Plugin-InstallDir:
/usr/lib64/cmake/libyui-qt-pkg
[ 11s] -- use Doc-Dir:
/usr/share/doc/packages/libyui-qt-pkg6
[ 11s] -- Data-Dir: /usr/share/libyui
[ 11s] -- Theme-Dir: /usr/share/libyui/theme
[ 11s] --
[ 11s] -- Disable shared library: OFF
[ 11s] -- Include Debug-Symbols in library: OFF
[ 11s] -- Build a static library, too: OFF
[ 11s] -- Build the examples, too: ON
[ 11s] --
[ 11s] --
********************************************************************************
[ 11s] --
[ 11s] -- Configuring done
[ 11s] -- Generating done
[ 11s] -- Build files have been written to:
/home/abuild/rpmbuild/BUILD/libyui-qt-pkg-2.44.0/build
[ 11s] + make -j2
[ 11s] Scanning dependencies of target yui-qt-pkg_automoc
[ 11s] [ 2%] Automoc for target yui-qt-pkg
[ 12s] Generating YQPackageSelector.moc
[ 12s]
/home/abuild/rpmbuild/BUILD/libyui-qt-pkg-2.44.0/src/YQPackageSelector.cc:0:
Note: No relevant classes found. No output generated.
[ 14s] Generating YQPackageSelectorBase.moc
[ 14s]
/home/abuild/rpmbuild/BUILD/libyui-qt-pkg-2.44.0/src/YQPackageSelectorBase.cc:0:
Note: No relevant classes found. No output generated.
[ 15s] Generating YQPatternSelector.moc
[ 15s]
/home/abuild/rpmbuild/BUILD/libyui-qt-pkg-2.44.0/src/YQPatternSelector.cc:0:
Note: No relevant classes found. No output generated.
[ 16s] Generating YQPkgChangeLogView.moc
[ 16s]
/home/abuild/rpmbuild/BUILD/libyui-qt-pkg-2.44.0/src/YQPkgChangeLogView.cc:0:
Note: No relevant classes found. No output generated.
[ 17s] Generating YQPkgChangesDialog.moc
[ 17s]
/home/abuild/rpmbuild/BUILD/libyui-qt-pkg-2.44.0/src/YQPkgChangesDialog.cc:0:
Note: No relevant classes found. No output generated.
[ 19s] Generating YQPkgConflictDialog.moc
[ 19s]
/home/abuild/rpmbuild/BUILD/libyui-qt-pkg-2.44.0/src/YQPkgConflictDialog.cc:0:
Note: No relevant classes found. No output generated.
[ 20s] Generating YQPkgConflictList.moc
[ 20s]
/home/abuild/rpmbuild/BUILD/libyui-qt-pkg-2.44.0/src/YQPkgConflictList.cc:0:
Note: No relevant classes found. No output generated.
[ 21s] Generating YQPkgDependenciesView.moc
[ 21s]
/home/abuild/rpmbuild/BUILD/libyui-qt-pkg-2.44.0/src/YQPkgDependenciesView.cc:0:
Note: No relevant classes found. No output generated.
[ 22s] Generating YQPkgDescriptionDialog.moc
[ 22s]
/home/abuild/rpmbuild/BUILD/libyui-qt-pkg-2.44.0/src/YQPkgDescriptionDialog.cc:0:
Note: No relevant classes found. No output generated.
[ 24s] Generating YQPkgDescriptionView.moc
[ 24s]
/home/abuild/rpmbuild/BUILD/libyui-qt-pkg-2.44.0/src/YQPkgDescriptionView.cc:0:
Note: No relevant classes found. No output generated.
[ 25s] Generating YQPkgDiskUsageList.moc
[ 25s]
/home/abuild/rpmbuild/BUILD/libyui-qt-pkg-2.44.0/src/YQPkgDiskUsageList.cc:0:
Note: No relevant classes found. No output generated.
[ 26s] Generating YQPkgDiskUsageWarningDialog.moc
[ 26s]
/home/abuild/rpmbuild/BUILD/libyui-qt-pkg-2.44.0/src/YQPkgDiskUsageWarningDialog.cc:0:
Note: No relevant classes found. No output generated.
[ 27s] Generating YQPkgFileListView.moc
[ 27s]
/home/abuild/rpmbuild/BUILD/libyui-qt-pkg-2.44.0/src/YQPkgFileListView.cc:0:
Note: No relevant classes found. No output generated.
[ 29s] Generating YQPkgFilterTab.moc
[ 29s]
/home/abuild/rpmbuild/BUILD/libyui-qt-pkg-2.44.0/src/YQPkgFilterTab.cc:0: Note:
No relevant classes found. No output generated.
[ 30s] Generating YQPkgGenericDetailsView.moc
[ 30s]
/home/abuild/rpmbuild/BUILD/libyui-qt-pkg-2.44.0/src/YQPkgGenericDetailsView.cc:0:
Note: No relevant classes found. No output generated.
[ 31s] Generating YQPkgHistoryDialog.moc
[ 31s]
/home/abuild/rpmbuild/BUILD/libyui-qt-pkg-2.44.0/src/YQPkgHistoryDialog.cc:0:
Note: No relevant classes found. No output generated.
[ 32s] Generating YQPkgLangList.moc
[ 32s]
/home/abuild/rpmbuild/BUILD/libyui-qt-pkg-2.44.0/src/YQPkgLangList.cc:0: Note:
No relevant classes found. No output generated.
[ 34s] Generating YQPkgList.moc
[ 34s] /home/abuild/rpmbuild/BUILD/libyui-qt-pkg-2.44.0/src/YQPkgList.cc:0:
Note: No relevant classes found. No output generated.
[ 35s] Generating YQPkgObjList.moc
[ 35s]
/home/abuild/rpmbuild/BUILD/libyui-qt-pkg-2.44.0/src/YQPkgObjList.cc:0: Note:
No relevant classes found. No output generated.
[ 36s] Generating YQPkgPackageKitGroupsFilterView.moc
[ 36s]
/home/abuild/rpmbuild/BUILD/libyui-qt-pkg-2.44.0/src/YQPkgPackageKitGroupsFilterView.cc:0:
Note: No relevant classes found. No output generated.
[ 37s] Generating YQPkgPatchFilterView.moc
[ 37s]
/home/abuild/rpmbuild/BUILD/libyui-qt-pkg-2.44.0/src/YQPkgPatchFilterView.cc:0:
Note: No relevant classes found. No output generated.
[ 38s] Generating YQPkgPatchList.moc
[ 38s]
/home/abuild/rpmbuild/BUILD/libyui-qt-pkg-2.44.0/src/YQPkgPatchList.cc:0: Note:
No relevant classes found. No output generated.
[ 40s] Generating YQPkgPatternList.moc
[ 40s]
/home/abuild/rpmbuild/BUILD/libyui-qt-pkg-2.44.0/src/YQPkgPatternList.cc:0:
Note: No relevant classes found. No output generated.
[ 41s] Generating YQPkgProductDialog.moc
[ 41s]
/home/abuild/rpmbuild/BUILD/libyui-qt-pkg-2.44.0/src/YQPkgProductDialog.cc:0:
Note: No relevant classes found. No output generated.
[ 42s] Generating YQPkgProductList.moc
[ 42s]
/home/abuild/rpmbuild/BUILD/libyui-qt-pkg-2.44.0/src/YQPkgProductList.cc:0:
Note: No relevant classes found. No output generated.
[ 43s] Generating YQPkgRepoFilterView.moc
[ 43s]
/home/abuild/rpmbuild/BUILD/libyui-qt-pkg-2.44.0/src/YQPkgRepoFilterView.cc:0:
Note: No relevant classes found. No output generated.
[ 45s] Generating YQPkgRepoList.moc
[ 45s]
/home/abuild/rpmbuild/BUILD/libyui-qt-pkg-2.44.0/src/YQPkgRepoList.cc:0: Note:
No relevant classes found. No output generated.
[ 46s] Generating YQPkgRpmGroupTagsFilterView.moc
[ 46s]
/home/abuild/rpmbuild/BUILD/libyui-qt-pkg-2.44.0/src/YQPkgRpmGroupTagsFilterView.cc:0:
Note: No relevant classes found. No output generated.
[ 47s] Generating YQPkgSearchFilterView.moc
[ 47s]
/home/abuild/rpmbuild/BUILD/libyui-qt-pkg-2.44.0/src/YQPkgSearchFilterView.cc:0:
Note: No relevant classes found. No output generated.
[ 48s] Generating YQPkgSelDescriptionView.moc
[ 48s]
/home/abuild/rpmbuild/BUILD/libyui-qt-pkg-2.44.0/src/YQPkgSelDescriptionView.cc:0:
Note: No relevant classes found. No output generated.
[ 49s] Generating YQPkgStatusFilterView.moc
[ 49s]
/home/abuild/rpmbuild/BUILD/libyui-qt-pkg-2.44.0/src/YQPkgStatusFilterView.cc:0:
Note: No relevant classes found. No output generated.
[ 51s] Generating YQPkgTechnicalDetailsView.moc
[ 51s]
/home/abuild/rpmbuild/BUILD/libyui-qt-pkg-2.44.0/src/YQPkgTechnicalDetailsView.cc:0:
Note: No relevant classes found. No output generated.
[ 52s] Generating YQPkgTextDialog.moc
[ 52s]
/home/abuild/rpmbuild/BUILD/libyui-qt-pkg-2.44.0/src/YQPkgTextDialog.cc:0:
Note: No relevant classes found. No output generated.
[ 53s] Generating YQPkgUpdateProblemFilterView.moc
[ 53s]
/home/abuild/rpmbuild/BUILD/libyui-qt-pkg-2.44.0/src/YQPkgUpdateProblemFilterView.cc:0:
Note: No relevant classes found. No output generated.
[ 54s] Generating YQPkgVersionsView.moc
[ 54s]
/home/abuild/rpmbuild/BUILD/libyui-qt-pkg-2.44.0/src/YQPkgVersionsView.cc:0:
Note: No relevant classes found. No output generated.
[ 56s] Generating YQSimplePatchSelector.moc
[ 56s]
/home/abuild/rpmbuild/BUILD/libyui-qt-pkg-2.44.0/src/YQSimplePatchSelector.cc:0:
Note: No relevant classes found. No output generated.
[ 92s] Generating moc_YQPackageSelector.cpp
[ 92s] Generating moc_YQPackageSelectorBase.cpp
[ 92s] Generating moc_YQPatternSelector.cpp
[ 92s] Generating moc_YQPkgChangeLogView.cpp
[ 92s] Generating moc_YQPkgChangesDialog.cpp
[ 92s] Generating moc_YQPkgConflictDialog.cpp
[ 92s] Generating moc_YQPkgConflictList.cpp
[ 92s] Generating moc_YQPkgDependenciesView.cpp
[ 92s] Generating moc_YQPkgDescriptionDialog.cpp
[ 92s] Generating moc_YQPkgDescriptionView.cpp
[ 92s] Generating moc_YQPkgDiskUsageList.cpp
[ 92s] Generating moc_YQPkgDiskUsageWarningDialog.cpp
[ 92s] Generating moc_YQPkgFileListView.cpp
[ 92s] Generating moc_YQPkgFilterTab.cpp
[ 92s] Generating moc_YQPkgGenericDetailsView.cpp
[ 92s] Generating moc_YQPkgHistoryDialog.cpp
[ 92s] Generating moc_YQPkgLangList.cpp
[ 92s] Generating moc_YQPkgList.cpp
[ 92s] Generating moc_YQPkgObjList.cpp
[ 92s] Generating moc_YQPkgPackageKitGroupsFilterView.cpp
[ 92s] Generating moc_YQPkgPatchFilterView.cpp
[ 92s] Generating moc_YQPkgPatchList.cpp
[ 92s] Generating moc_YQPkgPatternList.cpp
[ 92s] Generating moc_YQPkgProductDialog.cpp
[ 92s] Generating moc_YQPkgProductList.cpp
[ 92s] Generating moc_YQPkgRepoFilterView.cpp
[ 92s] Generating moc_YQPkgRepoList.cpp
[ 92s] Generating moc_YQPkgRpmGroupTagsFilterView.cpp
[ 92s] Generating moc_YQPkgSearchFilterView.cpp
[ 92s] Generating moc_YQPkgSelDescriptionView.cpp
[ 92s] Generating moc_YQPkgStatusFilterView.cpp
[ 92s] Generating moc_YQPkgTechnicalDetailsView.cpp
[ 92s] Generating moc_YQPkgTextDialog.cpp
[ 92s] Generating moc_YQPkgUpdateProblemFilterView.cpp
[ 92s] Generating moc_YQPkgVersionsView.cpp
[ 92s] Generating moc_YQSimplePatchSelector.cpp
[ 92s] [ 2%] Built target yui-qt-pkg_automoc
[ 93s] Scanning dependencies of target yui-qt-pkg
[ 93s] [ 4%] [ 6%] Building CXX object
src/CMakeFiles/yui-qt-pkg.dir/YQIconPool.cc.o
[ 93s] Building CXX object src/CMakeFiles/yui-qt-pkg.dir/QY2LayoutUtils.cc.o
[ 94s] [ 9%] Building CXX object
src/CMakeFiles/yui-qt-pkg.dir/YQPackageSelectorBase.cc.o
[ 95s] [ 11%] Building CXX object
src/CMakeFiles/yui-qt-pkg.dir/YQPackageSelector.cc.o
[ 101s] [ 13%] Building CXX object
src/CMakeFiles/yui-qt-pkg.dir/YQPackageSelectorHelp.cc.o
[ 103s] [ 15%] Building CXX object
src/CMakeFiles/yui-qt-pkg.dir/YQPatternSelector.cc.o
[ 108s] [ 18%] Building CXX object
src/CMakeFiles/yui-qt-pkg.dir/YQSimplePatchSelector.cc.o
[ 109s] [ 20%] Building CXX object
src/CMakeFiles/yui-qt-pkg.dir/YQPkgChangeLogView.cc.o
[ 113s] [ 22%] Building CXX object
src/CMakeFiles/yui-qt-pkg.dir/YQPkgChangesDialog.cc.o
[ 114s] [ 25%] Building CXX object
src/CMakeFiles/yui-qt-pkg.dir/YQPkgConflictDialog.cc.o
[ 119s] [ 27%] Building CXX object
src/CMakeFiles/yui-qt-pkg.dir/YQPkgConflictList.cc.o
[ 120s] [ 29%] Building CXX object
src/CMakeFiles/yui-qt-pkg.dir/YQPkgDependenciesView.cc.o
[ 126s] [ 31%] Building CXX object
src/CMakeFiles/yui-qt-pkg.dir/YQPkgDescriptionDialog.cc.o
[ 126s] [ 34%] Building CXX object
src/CMakeFiles/yui-qt-pkg.dir/YQPkgDescriptionView.cc.o
[ 131s] [ 36%] Building CXX object
src/CMakeFiles/yui-qt-pkg.dir/YQPkgDiskUsageList.cc.o
[ 133s] [ 38%] Building CXX object
src/CMakeFiles/yui-qt-pkg.dir/YQPkgDiskUsageWarningDialog.cc.o
[ 137s] [ 40%] Building CXX object
src/CMakeFiles/yui-qt-pkg.dir/YQPkgFileListView.cc.o
[ 138s] [ 43%] Building CXX object
src/CMakeFiles/yui-qt-pkg.dir/YQPkgFilterTab.cc.o
[ 143s] [ 45%] Building CXX object
src/CMakeFiles/yui-qt-pkg.dir/YQPkgGenericDetailsView.cc.o
[ 144s] [ 47%] Building CXX object
src/CMakeFiles/yui-qt-pkg.dir/YQPkgHistoryDialog.cc.o
[ 149s] [ 50%] Building CXX object
src/CMakeFiles/yui-qt-pkg.dir/YQPkgLangList.cc.o
[ 150s] [ 52%] Building CXX object src/CMakeFiles/yui-qt-pkg.dir/YQPkgList.cc.o
[ 155s] [ 54%] Building CXX object
src/CMakeFiles/yui-qt-pkg.dir/YQPkgObjList.cc.o
[ 157s] [ 56%] Building CXX object
src/CMakeFiles/yui-qt-pkg.dir/YQPkgPackageKitGroupsFilterView.cc.o
[ 163s] [ 59%] Building CXX object
src/CMakeFiles/yui-qt-pkg.dir/YQPkgPatchFilterView.cc.o
[ 164s] [ 61%] Building CXX object
src/CMakeFiles/yui-qt-pkg.dir/YQPkgPatchList.cc.o
[ 169s] [ 63%] Building CXX object
src/CMakeFiles/yui-qt-pkg.dir/YQPkgPatternList.cc.o
[ 171s] [ 65%] Building CXX object
src/CMakeFiles/yui-qt-pkg.dir/YQPkgProductDialog.cc.o
[ 176s] [ 68%] Building CXX object
src/CMakeFiles/yui-qt-pkg.dir/YQPkgProductList.cc.o
[ 176s] [ 70%] Building CXX object
src/CMakeFiles/yui-qt-pkg.dir/YQPkgRepoFilterView.cc.o
[ 181s] [ 72%] Building CXX object
src/CMakeFiles/yui-qt-pkg.dir/YQPkgRepoList.cc.o
[ 182s] [ 75%] Building CXX object
src/CMakeFiles/yui-qt-pkg.dir/YQPkgRpmGroupTagsFilterView.cc.o
[ 187s] [ 77%] Building CXX object
src/CMakeFiles/yui-qt-pkg.dir/YQPkgSearchFilterView.cc.o
[ 188s] [ 79%] Building CXX object
src/CMakeFiles/yui-qt-pkg.dir/YQPkgSelDescriptionView.cc.o
[ 194s] [ 81%] Building CXX object
src/CMakeFiles/yui-qt-pkg.dir/YQPkgSelMapper.cc.o
[ 194s] [ 84%] Building CXX object
src/CMakeFiles/yui-qt-pkg.dir/YQPkgStatusFilterView.cc.o
[ 198s] [ 86%] Building CXX object
src/CMakeFiles/yui-qt-pkg.dir/YQPkgTechnicalDetailsView.cc.o
[ 200s] [ 88%] Building CXX object
src/CMakeFiles/yui-qt-pkg.dir/YQPkgTextDialog.cc.o
[ 205s] [ 90%] Building CXX object
src/CMakeFiles/yui-qt-pkg.dir/YQPkgUpdateProblemFilterView.cc.o
[ 205s] [ 93%] Building CXX object
src/CMakeFiles/yui-qt-pkg.dir/YQPkgVersionsView.cc.o
[ 210s] [ 95%] Building CXX object
src/CMakeFiles/yui-qt-pkg.dir/YQPackageSelectorPluginImpl.cc.o
[ 212s] [ 97%] Building CXX object
src/CMakeFiles/yui-qt-pkg.dir/YQZyppSolverDialogPluginStub.cc.o
[ 216s] [100%] Building CXX object
src/CMakeFiles/yui-qt-pkg.dir/yui-qt-pkg_automoc.cpp.o
[ 223s] Linking CXX shared library libyui-qt-pkg.so
[ 223s]
/usr/lib64/gcc/x86_64-suse-linux/4.8/../../../../x86_64-suse-linux/bin/ld:
cannot find -lfontconfig
[ 223s] collect2: error: ld returned 1 exit status
[ 223s] src/CMakeFiles/yui-qt-pkg.dir/build.make:1150: recipe for target
'src/libyui-qt-pkg.so.6.0.0' failed
[ 223s] make[2]: *** [src/libyui-qt-pkg.so.6.0.0] Error 1
[ 223s] CMakeFiles/Makefile2:143: recipe for target
'src/CMakeFiles/yui-qt-pkg.dir/all' failed
[ 223s] make[1]: *** [src/CMakeFiles/yui-qt-pkg.dir/all] Error 2
[ 223s] Makefile:136: recipe for target 'all' failed
[ 223s] make: *** [all] Error 2
[ 223s] error: Bad exit status from /var/tmp/rpm-tmp.Wmaka1 (%build)
[ 223s]
[ 223s]
[ 223s] RPM build errors:
[ 223s] Bad exit status from /var/tmp/rpm-tmp.Wmaka1 (%build)
Building libyui-qt-pkg.spec for openSUSE_Factory/x86_64
Getting buildinfo from server and store to
<http://ci.opensuse.org/job/libyui-qt-pkg-master/ws/devel>:libraries:libyui/libyui-qt-pkg/.osc/_buildinfo-openSUSE_Factory-x86_64.xml
Getting buildconfig from server and store to
<http://ci.opensuse.org/job/libyui-qt-pkg-master/ws/devel>:libraries:libyui/libyui-qt-pkg/.osc/_buildconfig-openSUSE_Factory-x86_64
Updating cache of required packages
0.0% cache miss. 317/317 dependencies cached.

Skipping verification of package signatures
Writing build configuration
Running build

The buildroot was: /var/tmp/build-root-openSUSE_Factory
rm -rf devel:libraries:libyui
rake aborted!
Command failed with status (1): [yes | osc build --no-verify --release=1 --...]

Tasks: TOP => osc:sr => osc:commit => osc:build
(See full trace by running task with --trace)
cleaning
Build step 'Execute shell' marked build as failure
--
To unsubscribe, e-mail: libyui-commit+unsubscribe@xxxxxxxxxxxx
To contact the owner, e-mail: libyui-commit+owner@xxxxxxxxxxxx

< Previous Next >
Follow Ups
References