Mailinglist Archive: libyui-commit (28 mails)

< Previous Next >
[libyui-commit] Build failed in Jenkins: libyui-qt-pkg-master #4
  • From: admin@xxxxxxxxxxxx
  • Date: Fri, 21 Feb 2014 16:39:04 +0100 (CET)
  • Message-id: <2146926583.14.1392997144857.JavaMail.jenkins@ci-opensuse>
See <http://ci.opensuse.org/job/libyui-qt-pkg-master/4/>

------------------------------------------
[...truncated 921 lines...]
[ 16s] + export 'CFLAGS=-fmessage-length=0 -grecord-gcc-switches -O2 -Wall
-D_FORTIFY_SOURCE=2 -fstack-protector -funwind-tables
-fasynchronous-unwind-tables -DNDEBUG'
[ 16s] + CFLAGS='-fmessage-length=0 -grecord-gcc-switches -O2 -Wall
-D_FORTIFY_SOURCE=2 -fstack-protector -funwind-tables
-fasynchronous-unwind-tables -DNDEBUG'
[ 16s] + export 'CXXFLAGS=-fmessage-length=0 -grecord-gcc-switches -O2 -Wall
-D_FORTIFY_SOURCE=2 -fstack-protector -funwind-tables
-fasynchronous-unwind-tables -DNDEBUG'
[ 16s] + CXXFLAGS='-fmessage-length=0 -grecord-gcc-switches -O2 -Wall
-D_FORTIFY_SOURCE=2 -fstack-protector -funwind-tables
-fasynchronous-unwind-tables -DNDEBUG'
[ 16s] + ./bootstrap.sh /usr
[ 16s] checking for /usr/share/libyui/buildtools/CMakeLists.common...
[ 16s] OK: linked to
/home/abuild/rpmbuild/BUILD/libyui-qt-pkg-2.44.0/./CMakeLists.txt.
[ 16s] + mkdir build
[ 16s] + cd build
[ 16s] + cmake .. -DPREFIX=/usr -DDOC_DIR=/usr/share/doc/packages
-DLIB_DIR=lib64 -DCMAKE_BUILD_TYPE=RELEASE
[ 16s] -- The C compiler identification is GNU 4.8.2
[ 16s] -- The CXX compiler identification is GNU 4.8.2
[ 16s] -- Check for working C compiler: /usr/bin/cc
[ 16s] -- Check for working C compiler: /usr/bin/cc -- works
[ 16s] -- Detecting C compiler ABI info
[ 17s] -- Detecting C compiler ABI info - done
[ 17s] -- Check for working CXX compiler: /usr/bin/c++
[ 17s] -- Check for working CXX compiler: /usr/bin/c++ -- works
[ 17s] -- Detecting CXX compiler ABI info
[ 17s] -- Detecting CXX compiler ABI info - done
[ 17s] -- ZYpp path not set. Looking for it.
[ 17s] -- ZYpp found: includes in /usr/include, library in
/usr/lib64/libzypp.so
[ 17s] -- Found Libyui: (Version: 3.0.13)
[ 17s] -- Found Libyui-qt: (Version: 2.45.0)
[ 17s] -- zypp found
[ 17s] -- USE_C_STD not set, defaulting to gnu99
[ 17s] -- Could NOT find Doxygen (missing: DOXYGEN_EXECUTABLE)
[ 17s] --
[ 17s] --
********************************************************************************
[ 17s] --
[ 17s] -- libyui-qt-pkg has been configured with following options:
[ 17s] --
[ 17s] -- Plugin-Name: qt-pkg
[ 17s] -- Extension-Name:
[ 17s] -- Library-Dependencies:
Qt5Core;Qt5Gui;Qt5Widgets;Zypp;Libyui;Libyui-qt
[ 17s] -- Plugin is for use with:
[ 17s] -- targetlib to build: yui-qt-pkg
[ 17s] --
[ 17s] -- Version: 2.44.0
[ 17s] -- SO-Version: 6.0.0
[ 17s] --
[ 17s] -- Used Build-Option: RELEASE
[ 17s] -- Used Compiler-Flags: -fmessage-length=0
-grecord-gcc-switches -O2 -Wall -D_FORTIFY_SOURCE=2 -fstack-protector
-funwind-tables -fasynchronous-unwind-tables -DNDEBUG -std=c++0x
-fmessage-length=0 -Wall -Werror -O3
[ 17s] -- linking against: zypp
[ 17s] -- using includes from:
/usr/include/yui/qt;/usr/include/yui/qt/..;/usr/include/yui;/usr/include/yui/..;/usr/include
[ 17s] --
[ 17s] --
[ 17s] -- Install to Prefix: /usr
[ 17s] -- use Shared-Dir: /usr/share
[ 17s] -- use Library-Dir: /usr/lib64/yui
[ 17s] -- use Include-Dir: /usr/include/yui/qt-pkg
[ 17s] -- use CMake Plugin-InstallDir:
/usr/lib64/cmake/libyui-qt-pkg
[ 17s] -- use Doc-Dir:
/usr/share/doc/packages/libyui-qt-pkg6
[ 17s] -- Data-Dir: /usr/share/libyui
[ 17s] -- Theme-Dir: /usr/share/libyui/theme
[ 17s] --
[ 17s] -- Disable shared library: OFF
[ 17s] -- Include Debug-Symbols in library: OFF
[ 17s] -- Build a static library, too: OFF
[ 17s] -- Build the examples, too: ON
[ 17s] --
[ 17s] --
********************************************************************************
[ 17s] --
[ 17s] -- Configuring done
[ 17s] -- Generating done
[ 17s] -- Build files have been written to:
/home/abuild/rpmbuild/BUILD/libyui-qt-pkg-2.44.0/build
[ 17s] + make -j2
[ 17s] Scanning dependencies of target yui-qt-pkg_automoc
[ 17s] [ 2%] Automoc for target yui-qt-pkg
[ 19s] Generating YQPackageSelector.moc
[ 19s]
/home/abuild/rpmbuild/BUILD/libyui-qt-pkg-2.44.0/src/YQPackageSelector.cc:0:
Note: No relevant classes found. No output generated.
[ 20s] Generating YQPackageSelectorBase.moc
[ 20s]
/home/abuild/rpmbuild/BUILD/libyui-qt-pkg-2.44.0/src/YQPackageSelectorBase.cc:0:
Note: No relevant classes found. No output generated.
[ 21s] Generating YQPatternSelector.moc
[ 21s]
/home/abuild/rpmbuild/BUILD/libyui-qt-pkg-2.44.0/src/YQPatternSelector.cc:0:
Note: No relevant classes found. No output generated.
[ 22s] Generating YQPkgChangeLogView.moc
[ 22s]
/home/abuild/rpmbuild/BUILD/libyui-qt-pkg-2.44.0/src/YQPkgChangeLogView.cc:0:
Note: No relevant classes found. No output generated.
[ 24s] Generating YQPkgChangesDialog.moc
[ 24s]
/home/abuild/rpmbuild/BUILD/libyui-qt-pkg-2.44.0/src/YQPkgChangesDialog.cc:0:
Note: No relevant classes found. No output generated.
[ 25s] Generating YQPkgConflictDialog.moc
[ 25s]
/home/abuild/rpmbuild/BUILD/libyui-qt-pkg-2.44.0/src/YQPkgConflictDialog.cc:0:
Note: No relevant classes found. No output generated.
[ 26s] Generating YQPkgConflictList.moc
[ 26s]
/home/abuild/rpmbuild/BUILD/libyui-qt-pkg-2.44.0/src/YQPkgConflictList.cc:0:
Note: No relevant classes found. No output generated.
[ 27s] Generating YQPkgDependenciesView.moc
[ 27s]
/home/abuild/rpmbuild/BUILD/libyui-qt-pkg-2.44.0/src/YQPkgDependenciesView.cc:0:
Note: No relevant classes found. No output generated.
[ 28s] Generating YQPkgDescriptionDialog.moc
[ 28s]
/home/abuild/rpmbuild/BUILD/libyui-qt-pkg-2.44.0/src/YQPkgDescriptionDialog.cc:0:
Note: No relevant classes found. No output generated.
[ 30s] Generating YQPkgDescriptionView.moc
[ 30s]
/home/abuild/rpmbuild/BUILD/libyui-qt-pkg-2.44.0/src/YQPkgDescriptionView.cc:0:
Note: No relevant classes found. No output generated.
[ 31s] Generating YQPkgDiskUsageList.moc
[ 31s]
/home/abuild/rpmbuild/BUILD/libyui-qt-pkg-2.44.0/src/YQPkgDiskUsageList.cc:0:
Note: No relevant classes found. No output generated.
[ 32s] Generating YQPkgDiskUsageWarningDialog.moc
[ 32s]
/home/abuild/rpmbuild/BUILD/libyui-qt-pkg-2.44.0/src/YQPkgDiskUsageWarningDialog.cc:0:
Note: No relevant classes found. No output generated.
[ 33s] Generating YQPkgFileListView.moc
[ 33s]
/home/abuild/rpmbuild/BUILD/libyui-qt-pkg-2.44.0/src/YQPkgFileListView.cc:0:
Note: No relevant classes found. No output generated.
[ 34s] Generating YQPkgFilterTab.moc
[ 34s]
/home/abuild/rpmbuild/BUILD/libyui-qt-pkg-2.44.0/src/YQPkgFilterTab.cc:0: Note:
No relevant classes found. No output generated.
[ 36s] Generating YQPkgGenericDetailsView.moc
[ 36s]
/home/abuild/rpmbuild/BUILD/libyui-qt-pkg-2.44.0/src/YQPkgGenericDetailsView.cc:0:
Note: No relevant classes found. No output generated.
[ 37s] Generating YQPkgHistoryDialog.moc
[ 37s]
/home/abuild/rpmbuild/BUILD/libyui-qt-pkg-2.44.0/src/YQPkgHistoryDialog.cc:0:
Note: No relevant classes found. No output generated.
[ 38s] Generating YQPkgLangList.moc
[ 38s]
/home/abuild/rpmbuild/BUILD/libyui-qt-pkg-2.44.0/src/YQPkgLangList.cc:0: Note:
No relevant classes found. No output generated.
[ 39s] Generating YQPkgList.moc
[ 39s] /home/abuild/rpmbuild/BUILD/libyui-qt-pkg-2.44.0/src/YQPkgList.cc:0:
Note: No relevant classes found. No output generated.
[ 40s] Generating YQPkgObjList.moc
[ 40s]
/home/abuild/rpmbuild/BUILD/libyui-qt-pkg-2.44.0/src/YQPkgObjList.cc:0: Note:
No relevant classes found. No output generated.
[ 41s] Generating YQPkgPackageKitGroupsFilterView.moc
[ 41s]
/home/abuild/rpmbuild/BUILD/libyui-qt-pkg-2.44.0/src/YQPkgPackageKitGroupsFilterView.cc:0:
Note: No relevant classes found. No output generated.
[ 43s] Generating YQPkgPatchFilterView.moc
[ 43s]
/home/abuild/rpmbuild/BUILD/libyui-qt-pkg-2.44.0/src/YQPkgPatchFilterView.cc:0:
Note: No relevant classes found. No output generated.
[ 44s] Generating YQPkgPatchList.moc
[ 44s]
/home/abuild/rpmbuild/BUILD/libyui-qt-pkg-2.44.0/src/YQPkgPatchList.cc:0: Note:
No relevant classes found. No output generated.
[ 45s] Generating YQPkgPatternList.moc
[ 45s]
/home/abuild/rpmbuild/BUILD/libyui-qt-pkg-2.44.0/src/YQPkgPatternList.cc:0:
Note: No relevant classes found. No output generated.
[ 46s] Generating YQPkgProductDialog.moc
[ 46s]
/home/abuild/rpmbuild/BUILD/libyui-qt-pkg-2.44.0/src/YQPkgProductDialog.cc:0:
Note: No relevant classes found. No output generated.
[ 47s] Generating YQPkgProductList.moc
[ 47s]
/home/abuild/rpmbuild/BUILD/libyui-qt-pkg-2.44.0/src/YQPkgProductList.cc:0:
Note: No relevant classes found. No output generated.
[ 49s] Generating YQPkgRepoFilterView.moc
[ 49s]
/home/abuild/rpmbuild/BUILD/libyui-qt-pkg-2.44.0/src/YQPkgRepoFilterView.cc:0:
Note: No relevant classes found. No output generated.
[ 50s] Generating YQPkgRepoList.moc
[ 50s]
/home/abuild/rpmbuild/BUILD/libyui-qt-pkg-2.44.0/src/YQPkgRepoList.cc:0: Note:
No relevant classes found. No output generated.
[ 51s] Generating YQPkgRpmGroupTagsFilterView.moc
[ 51s]
/home/abuild/rpmbuild/BUILD/libyui-qt-pkg-2.44.0/src/YQPkgRpmGroupTagsFilterView.cc:0:
Note: No relevant classes found. No output generated.
[ 52s] Generating YQPkgSearchFilterView.moc
[ 52s]
/home/abuild/rpmbuild/BUILD/libyui-qt-pkg-2.44.0/src/YQPkgSearchFilterView.cc:0:
Note: No relevant classes found. No output generated.
[ 53s] Generating YQPkgSelDescriptionView.moc
[ 53s]
/home/abuild/rpmbuild/BUILD/libyui-qt-pkg-2.44.0/src/YQPkgSelDescriptionView.cc:0:
Note: No relevant classes found. No output generated.
[ 54s] Generating YQPkgStatusFilterView.moc
[ 54s]
/home/abuild/rpmbuild/BUILD/libyui-qt-pkg-2.44.0/src/YQPkgStatusFilterView.cc:0:
Note: No relevant classes found. No output generated.
[ 56s] Generating YQPkgTechnicalDetailsView.moc
[ 56s]
/home/abuild/rpmbuild/BUILD/libyui-qt-pkg-2.44.0/src/YQPkgTechnicalDetailsView.cc:0:
Note: No relevant classes found. No output generated.
[ 57s] Generating YQPkgTextDialog.moc
[ 57s]
/home/abuild/rpmbuild/BUILD/libyui-qt-pkg-2.44.0/src/YQPkgTextDialog.cc:0:
Note: No relevant classes found. No output generated.
[ 58s] Generating YQPkgUpdateProblemFilterView.moc
[ 58s]
/home/abuild/rpmbuild/BUILD/libyui-qt-pkg-2.44.0/src/YQPkgUpdateProblemFilterView.cc:0:
Note: No relevant classes found. No output generated.
[ 59s] Generating YQPkgVersionsView.moc
[ 59s]
/home/abuild/rpmbuild/BUILD/libyui-qt-pkg-2.44.0/src/YQPkgVersionsView.cc:0:
Note: No relevant classes found. No output generated.
[ 61s] Generating YQSimplePatchSelector.moc
[ 61s]
/home/abuild/rpmbuild/BUILD/libyui-qt-pkg-2.44.0/src/YQSimplePatchSelector.cc:0:
Note: No relevant classes found. No output generated.
[ 96s] Generating moc_YQPackageSelector.cpp
[ 96s] Generating moc_YQPackageSelectorBase.cpp
[ 96s] Generating moc_YQPatternSelector.cpp
[ 96s] Generating moc_YQPkgChangeLogView.cpp
[ 96s] Generating moc_YQPkgChangesDialog.cpp
[ 96s] Generating moc_YQPkgConflictDialog.cpp
[ 96s] Generating moc_YQPkgConflictList.cpp
[ 96s] Generating moc_YQPkgDependenciesView.cpp
[ 96s] Generating moc_YQPkgDescriptionDialog.cpp
[ 96s] Generating moc_YQPkgDescriptionView.cpp
[ 96s] Generating moc_YQPkgDiskUsageList.cpp
[ 96s] Generating moc_YQPkgDiskUsageWarningDialog.cpp
[ 96s] Generating moc_YQPkgFileListView.cpp
[ 96s] Generating moc_YQPkgFilterTab.cpp
[ 96s] Generating moc_YQPkgGenericDetailsView.cpp
[ 96s] Generating moc_YQPkgHistoryDialog.cpp
[ 96s] Generating moc_YQPkgLangList.cpp
[ 96s] Generating moc_YQPkgList.cpp
[ 96s] Generating moc_YQPkgObjList.cpp
[ 96s] Generating moc_YQPkgPackageKitGroupsFilterView.cpp
[ 96s] Generating moc_YQPkgPatchFilterView.cpp
[ 96s] Generating moc_YQPkgPatchList.cpp
[ 96s] Generating moc_YQPkgPatternList.cpp
[ 96s] Generating moc_YQPkgProductDialog.cpp
[ 96s] Generating moc_YQPkgProductList.cpp
[ 96s] Generating moc_YQPkgRepoFilterView.cpp
[ 96s] Generating moc_YQPkgRepoList.cpp
[ 96s] Generating moc_YQPkgRpmGroupTagsFilterView.cpp
[ 96s] Generating moc_YQPkgSearchFilterView.cpp
[ 96s] Generating moc_YQPkgSelDescriptionView.cpp
[ 96s] Generating moc_YQPkgStatusFilterView.cpp
[ 96s] Generating moc_YQPkgTechnicalDetailsView.cpp
[ 96s] Generating moc_YQPkgTextDialog.cpp
[ 96s] Generating moc_YQPkgUpdateProblemFilterView.cpp
[ 96s] Generating moc_YQPkgVersionsView.cpp
[ 96s] Generating moc_YQSimplePatchSelector.cpp
[ 96s] [ 2%] Built target yui-qt-pkg_automoc
[ 97s] Scanning dependencies of target yui-qt-pkg
[ 97s] [ 4%] [ 6%] Building CXX object
src/CMakeFiles/yui-qt-pkg.dir/QY2LayoutUtils.cc.o
[ 97s] Building CXX object src/CMakeFiles/yui-qt-pkg.dir/YQIconPool.cc.o
[ 99s] [ 9%] [ 11%] Building CXX object
src/CMakeFiles/yui-qt-pkg.dir/YQPackageSelectorBase.cc.o
[ 99s] Building CXX object
src/CMakeFiles/yui-qt-pkg.dir/YQPackageSelector.cc.o
[ 105s] [ 13%] Building CXX object
src/CMakeFiles/yui-qt-pkg.dir/YQPackageSelectorHelp.cc.o
[ 107s] [ 15%] Building CXX object
src/CMakeFiles/yui-qt-pkg.dir/YQPatternSelector.cc.o
[ 111s] [ 18%] Building CXX object
src/CMakeFiles/yui-qt-pkg.dir/YQSimplePatchSelector.cc.o
[ 112s] [ 20%] Building CXX object
src/CMakeFiles/yui-qt-pkg.dir/YQPkgChangeLogView.cc.o
[ 117s] [ 22%] Building CXX object
src/CMakeFiles/yui-qt-pkg.dir/YQPkgChangesDialog.cc.o
[ 118s] [ 25%] Building CXX object
src/CMakeFiles/yui-qt-pkg.dir/YQPkgConflictDialog.cc.o
[ 122s] [ 27%] Building CXX object
src/CMakeFiles/yui-qt-pkg.dir/YQPkgConflictList.cc.o
[ 123s] [ 29%] Building CXX object
src/CMakeFiles/yui-qt-pkg.dir/YQPkgDependenciesView.cc.o
[ 129s] [ 31%] Building CXX object
src/CMakeFiles/yui-qt-pkg.dir/YQPkgDescriptionDialog.cc.o
[ 129s] [ 34%] Building CXX object
src/CMakeFiles/yui-qt-pkg.dir/YQPkgDescriptionView.cc.o
[ 134s] [ 36%] Building CXX object
src/CMakeFiles/yui-qt-pkg.dir/YQPkgDiskUsageList.cc.o
[ 135s] [ 38%] Building CXX object
src/CMakeFiles/yui-qt-pkg.dir/YQPkgDiskUsageWarningDialog.cc.o
[ 140s] [ 40%] Building CXX object
src/CMakeFiles/yui-qt-pkg.dir/YQPkgFileListView.cc.o
[ 141s] [ 43%] Building CXX object
src/CMakeFiles/yui-qt-pkg.dir/YQPkgFilterTab.cc.o
[ 145s] [ 45%] Building CXX object
src/CMakeFiles/yui-qt-pkg.dir/YQPkgGenericDetailsView.cc.o
[ 147s] [ 47%] Building CXX object
src/CMakeFiles/yui-qt-pkg.dir/YQPkgHistoryDialog.cc.o
[ 151s] [ 50%] Building CXX object
src/CMakeFiles/yui-qt-pkg.dir/YQPkgLangList.cc.o
[ 153s] [ 52%] Building CXX object src/CMakeFiles/yui-qt-pkg.dir/YQPkgList.cc.o
[ 158s] [ 54%] Building CXX object
src/CMakeFiles/yui-qt-pkg.dir/YQPkgObjList.cc.o
[ 160s] [ 56%] Building CXX object
src/CMakeFiles/yui-qt-pkg.dir/YQPkgPackageKitGroupsFilterView.cc.o
[ 165s] [ 59%] Building CXX object
src/CMakeFiles/yui-qt-pkg.dir/YQPkgPatchFilterView.cc.o
[ 166s] [ 61%] Building CXX object
src/CMakeFiles/yui-qt-pkg.dir/YQPkgPatchList.cc.o
[ 170s] [ 63%] Building CXX object
src/CMakeFiles/yui-qt-pkg.dir/YQPkgPatternList.cc.o
[ 172s] [ 65%] Building CXX object
src/CMakeFiles/yui-qt-pkg.dir/YQPkgProductDialog.cc.o
[ 177s] [ 68%] Building CXX object
src/CMakeFiles/yui-qt-pkg.dir/YQPkgProductList.cc.o
[ 177s] [ 70%] Building CXX object
src/CMakeFiles/yui-qt-pkg.dir/YQPkgRepoFilterView.cc.o
[ 182s] [ 72%] Building CXX object
src/CMakeFiles/yui-qt-pkg.dir/YQPkgRepoList.cc.o
[ 183s] [ 75%] Building CXX object
src/CMakeFiles/yui-qt-pkg.dir/YQPkgRpmGroupTagsFilterView.cc.o
[ 188s] [ 77%] Building CXX object
src/CMakeFiles/yui-qt-pkg.dir/YQPkgSearchFilterView.cc.o
[ 189s] [ 79%] Building CXX object
src/CMakeFiles/yui-qt-pkg.dir/YQPkgSelDescriptionView.cc.o
[ 195s] [ 81%] Building CXX object
src/CMakeFiles/yui-qt-pkg.dir/YQPkgSelMapper.cc.o
[ 196s] [ 84%] Building CXX object
src/CMakeFiles/yui-qt-pkg.dir/YQPkgStatusFilterView.cc.o
[ 200s] [ 86%] Building CXX object
src/CMakeFiles/yui-qt-pkg.dir/YQPkgTechnicalDetailsView.cc.o
[ 201s] [ 88%] Building CXX object
src/CMakeFiles/yui-qt-pkg.dir/YQPkgTextDialog.cc.o
[ 206s] [ 90%] Building CXX object
src/CMakeFiles/yui-qt-pkg.dir/YQPkgUpdateProblemFilterView.cc.o
[ 207s] [ 93%] Building CXX object
src/CMakeFiles/yui-qt-pkg.dir/YQPkgVersionsView.cc.o
[ 211s] [ 95%] Building CXX object
src/CMakeFiles/yui-qt-pkg.dir/YQPackageSelectorPluginImpl.cc.o
[ 213s] [ 97%] Building CXX object
src/CMakeFiles/yui-qt-pkg.dir/YQZyppSolverDialogPluginStub.cc.o
[ 217s] [100%] Building CXX object
src/CMakeFiles/yui-qt-pkg.dir/yui-qt-pkg_automoc.cpp.o
[ 224s] Linking CXX shared library libyui-qt-pkg.so
[ 224s]
/usr/lib64/gcc/x86_64-suse-linux/4.8/../../../../x86_64-suse-linux/bin/ld:
cannot find -lfontconfig
[ 224s] collect2: error: ld returned 1 exit status
[ 224s] src/CMakeFiles/yui-qt-pkg.dir/build.make:1150: recipe for target
'src/libyui-qt-pkg.so.6.0.0' failed
[ 224s] make[2]: *** [src/libyui-qt-pkg.so.6.0.0] Error 1
[ 224s] CMakeFiles/Makefile2:143: recipe for target
'src/CMakeFiles/yui-qt-pkg.dir/all' failed
[ 224s] make[1]: *** [src/CMakeFiles/yui-qt-pkg.dir/all] Error 2
[ 224s] Makefile:136: recipe for target 'all' failed
[ 224s] make: *** [all] Error 2
[ 224s] error: Bad exit status from /var/tmp/rpm-tmp.M3tJzw (%build)
[ 224s]
[ 224s]
[ 224s] RPM build errors:
[ 224s] Bad exit status from /var/tmp/rpm-tmp.M3tJzw (%build)
Skipping verification of package signatures
Writing build configuration
Running build

The buildroot was: /var/tmp/build-root-openSUSE_Factory
rm -rf devel:libraries:libyui
rake aborted!
Command failed with status (1): [yes | osc build --no-verify --release=1 --...]

Tasks: TOP => osc:sr => osc:commit => osc:build
(See full trace by running task with --trace)
cleaning
Build step 'Execute shell' marked build as failure
--
To unsubscribe, e-mail: libyui-commit+unsubscribe@xxxxxxxxxxxx
To contact the owner, e-mail: libyui-commit+owner@xxxxxxxxxxxx

< Previous Next >
Follow Ups
References