Mailinglist Archive: libyui-commit (28 mails)

< Previous Next >
[libyui-commit] Build failed in Jenkins: libyui-qt-graph-master #2
  • From: admin@xxxxxxxxxxxx
  • Date: Fri, 21 Feb 2014 15:32:04 +0100 (CET)
  • Message-id: <101254665.11.1392993124253.JavaMail.jenkins@ci-opensuse>
See <http://ci.opensuse.org/job/libyui-qt-graph-master/2/>

------------------------------------------
[...truncated 239 lines...]
[ 0s] running changelog2spec --target rpm --file
<http://ci.opensuse.org/job/libyui-qt-graph-master/ws/devel>:libraries:libyui/libyui-qt-graph/libyui-qt-graph.spec
[ 0s] init_buildsystem --configdir /usr/lib/build/configs --cachedir
/var/cache/build --rpmlist /tmp/rpmlist.TZD783
<http://ci.opensuse.org/job/libyui-qt-graph-master/ws/devel>:libraries:libyui/libyui-qt-graph/libyui-qt-graph.spec
...
[ 1s] Warning: ignoring unsupported tag 'cbinstall:'
[ 1s] Warning: ignoring unsupported tag 'cbpreinstall:'
[ 1s] reordering...cycle: libcrack2 -> cracklib
[ 1s] breaking dependency libcrack2 -> cracklib
[ 1s] cycle: gio-branding-upstream -> libgio-2_0-0
[ 1s] breaking dependency libgio-2_0-0 -> gio-branding-upstream
[ 1s] cycle: libudev-mini1 -> udev-mini
[ 1s] breaking dependency udev-mini -> libudev-mini1
[ 1s] cycle: libgtk-2_0-0 -> gtk2-tools
[ 1s] breaking dependency libgtk-2_0-0 -> gtk2-tools
[ 1s] cycle: libpango-1_0-0 -> pango-tools
[ 1s] breaking dependency pango-tools -> libpango-1_0-0
[ 2s] done
[ 2s] deleting dirmngr
[ 2s] deleting gpg2
[ 2s] deleting libadns1
[ 2s] deleting libassuan0
[ 2s] deleting libcurl-devel
[ 2s] deleting libgcrypt20
[ 2s] deleting libgpg-error0
[ 2s] deleting libksba8
[ 2s] deleting libmodman1
[ 2s] deleting libopenssl-devel
[ 2s] deleting libproxy1
[ 2s] deleting libpth20
[ 2s] deleting libsolv-devel
[ 3s] deleting libsolv-tools
[ 3s] deleting libudev-mini-devel
[ 3s] deleting libusb-0_1-4
[ 3s] deleting libusb-1_0-0
[ 3s] deleting libxml2-devel
[ 3s] deleting libxml2-tools
[ 3s] deleting libzypp
[ 3s] deleting libzypp-devel
[ 3s] deleting openssl
[ 3s] deleting popt-devel
[ 3s] deleting rpm-devel
[ 3s] deleting xz-devel
[ 3s] [1/324] [2/324] [3/324] [4/324] [5/324] [6/324] [7/324] [8/324]
cumulate xbitmaps-1.1.1-10.4
[ 4s] [9/324] [10/324] [11/324] [12/324] [13/324] [14/324] [15/324] [16/324]
[17/324] [18/324] [19/324] [20/324] [21/324] [22/324] [23/324] [24/324]
[25/324] [26/324] [27/324] [28/324] [29/324] [30/324] [31/324] [32/324]
[33/324] [34/324] [35/324] [36/324] [37/324] [38/324] [39/324] [40/324]
[41/324] [42/324] [43/324] [44/324] [45/324] [46/324] [47/324] [48/324]
[49/324] [50/324] cumulate libturbojpeg0-8.0.2-27.1
[ 4s] [51/324] [52/324] [53/324] [54/324] [55/324] [56/324] [57/324]
[58/324] [59/324] [60/324] [61/324] [62/324] [63/324] [64/324] [65/324]
[66/324] cumulate expat-2.1.0-13.4
[ 4s] [67/324] [68/324] [69/324] [70/324] [71/324] [72/324] [73/324]
[74/324] [75/324] cumulate libjpeg8-devel-8.0.2-27.1
[ 5s] [76/324] [77/324] [78/324] [79/324] [80/324] [81/324] [82/324]
[83/324] [84/324] [85/324] [86/324] [87/324] [88/324] [89/324] [90/324]
[91/324] [92/324] [93/324] [94/324] [95/324] [96/324] [97/324] [98/324]
[99/324] [100/324] [101/324] [102/324] [103/324] [104/324] [105/324] [106/324]
[107/324] [108/324] [109/324] [110/324] [111/324] [112/324] [113/324] [114/324]
[115/324] [116/324] [117/324] [118/324] [119/324] [120/324] [121/324] [122/324]
[123/324] [124/324] [125/324] [126/324] [127/324] [128/324] [129/324] [130/324]
[131/324] [132/324] [133/324] [134/324] [135/324] [136/324] [137/324] [138/324]
[139/324] [140/324] [141/324] [142/324] [143/324] [144/324] [145/324] [146/324]
[147/324] [148/324] [149/324] [150/324] [151/324] [152/324] [153/324] [154/324]
cumulate libXmuu1-1.1.2-3.4
[ 5s] [155/324] cumulate libXpm4-3.5.11-3.4
[ 5s] [156/324] [157/324] [158/324] [159/324] [160/324] cumulate
libXt6-1.1.4-3.4
[ 5s] [161/324] [162/324] [163/324] [164/324] [165/324] [166/324] [167/324]
[168/324] [169/324] [170/324] [171/324] [172/324] [173/324] [174/324] [175/324]
cumulate libXss1-1.2.2-8.4
[ 6s] [176/324] [177/324] cumulate xhost-1.0.6-3.4
[ 6s] [178/324] [179/324] [180/324] cumulate libXmu6-1.1.2-3.4
[ 6s] [181/324] [182/324] [183/324] [184/324] [185/324] [186/324] [187/324]
[188/324] [189/324] [190/324] [191/324] [192/324] [193/324] [194/324] cumulate
libXaw7-1.0.12-3.4
[ 6s] [195/324] [196/324] [197/324] [198/324] [199/324] [200/324] [201/324]
[202/324] [203/324] [204/324] [205/324] [206/324] [207/324] [208/324] [209/324]
[210/324] [211/324] [212/324] [213/324] cumulate tcl-8.6.1-1.4
[ 6s] [214/324] [215/324] cumulate autoconf-2.69-9.4
[ 6s] [216/324] [217/324] [218/324] [219/324] [220/324] cumulate
graphviz-2.34.0-2.1
[ 6s] [221/324] [222/324] cumulate tcl-devel-8.6.1-1.4
[ 6s] [223/324] [224/324] [225/324] cumulate automake-1.13.4-4.1
[ 6s] [226/324] [227/324] [228/324] [229/324] [230/324] cumulate tk-8.6.1-2.2
[ 6s] [231/324] [232/324] [233/324] [234/324] cumulate
libexpat-devel-2.1.0-13.4
[ 6s] [235/324] [236/324] [237/324] [238/324] cumulate libtool-2.4.2-12.4
[ 7s] [239/324] [240/324] [241/324] [242/324] [243/324] [244/324] [245/324]
[246/324] [247/324] [248/324] cumulate freetype2-devel-2.5.2-2.1
[ 7s] [249/324] [250/324] [251/324] [252/324] [253/324] cumulate
libpng16-devel-1.6.9-1.1
[ 7s] [254/324] [255/324] [256/324] cumulate libpng16-compat-devel-1.6.9-1.1
[ 7s] [257/324] cumulate fontconfig-devel-2.11.0-3.1
[ 7s] [258/324] [259/324] [260/324] [261/324] [262/324] [263/324] [264/324]
[265/324] [266/324] [267/324] [268/324] [269/324] [270/324] [271/324] cumulate
tk-devel-8.6.1-2.2
[ 7s] [272/324] [273/324] [274/324] [275/324] [276/324] [277/324] [278/324]
[279/324] [280/324] [281/324] cumulate graphviz-devel-2.34.0-2.1
[ 8s] [282/324] [283/324] [284/324] [285/324] [286/324] [287/324] [288/324]
[289/324] [290/324] [291/324] [292/324] [293/324] [294/324] [295/324] [296/324]
[297/324] [298/324] [299/324] [300/324] [301/324] [302/324] [303/324] [304/324]
[305/324] [306/324] [307/324] [308/324] [309/324] [310/324] [311/324] [312/324]
[313/324] [314/324] [315/324] [316/324] [317/324] [318/324] [319/324] [320/324]
[321/324] [322/324] [323/324] [324/324] now installing cumulated packages
[ 8s] Preparing...
########################################
[ 8s] Updating / installing...
[ 8s] libXt6-1.1.4-3.4
########################################
[ 8s] freetype2-devel-2.5.2-2.1
########################################
[ 8s] tcl-8.6.1-1.4
########################################
[ 8s] tcl-devel-8.6.1-1.4
########################################
[ 8s] libpng16-devel-1.6.9-1.1
########################################
[ 8s] libpng16-compat-devel-1.6.9-1.1
########################################
[ 8s] libexpat-devel-2.1.0-13.4
########################################
[ 8s] fontconfig-devel-2.11.0-3.1
########################################
[ 8s] autoconf-2.69-9.4
########################################
[ 8s] automake-1.13.4-4.1
########################################
[ 9s] libtool-2.4.2-12.4
########################################
[ 9s] libXss1-1.2.2-8.4
########################################
[ 9s] libXpm4-3.5.11-3.4
########################################
[ 9s] libXmuu1-1.1.2-3.4
########################################
[ 9s] xhost-1.0.6-3.4
########################################
[ 9s] tk-8.6.1-2.2
########################################
[ 9s] tk-devel-8.6.1-2.2
########################################
[ 9s] expat-2.1.0-13.4
########################################
[ 9s] libturbojpeg0-8.0.2-27.1
########################################
[ 9s] libjpeg8-devel-8.0.2-27.1
########################################
[ 9s] xbitmaps-1.1.1-10.4
########################################
[ 9s] libXmu6-1.1.2-3.4
########################################
[ 9s] libXaw7-1.0.12-3.4
########################################
[ 9s] graphviz-2.34.0-2.1
########################################
[ 9s] graphviz-devel-2.34.0-2.1
########################################
[ 9s] removing nis flags from
/var/tmp/build-root-openSUSE_Factory/etc/nsswitch.conf...
[ 9s] now finalizing build dir...
[ 10s] -----------------------------------------------------------------
[ 10s] I have the following modifications for libyui-qt-graph.spec:
[ 10s] 20c20
[ 10s] < Release: 0
[ 10s] ---
[ 10s] > Release: 1
[ 10s] -----------------------------------------------------------------
[ 10s] ----- building libyui-qt-graph.spec (user abuild)
[ 10s] -----------------------------------------------------------------
[ 10s] -----------------------------------------------------------------
[ 10s] + exec rpmbuild -ba --define '_srcdefattr (-,root,root)' --nosignature
/home/abuild/rpmbuild/SOURCES/libyui-qt-graph.spec
[ 10s] Executing(%prep): /bin/sh -e /var/tmp/rpm-tmp.CoDuUP
[ 10s] + umask 022
[ 10s] + cd /home/abuild/rpmbuild/BUILD
[ 10s] + cd /home/abuild/rpmbuild/BUILD
[ 10s] + rm -rf libyui-qt-graph-2.44.1
[ 10s] + /usr/bin/bzip2 -dc
/home/abuild/rpmbuild/SOURCES/libyui-qt-graph-2.44.1.tar.bz2
[ 10s] + /bin/tar -xf -
[ 10s] + STATUS=0
[ 10s] + '[' 0 -ne 0 ']'
[ 10s] + cd libyui-qt-graph-2.44.1
[ 10s] + /usr/bin/chmod -Rf a+rX,u+w,g-w,o-w .
[ 10s] + exit 0
[ 10s] Executing(%build): /bin/sh -e /var/tmp/rpm-tmp.Yn4R31
[ 10s] + umask 022
[ 10s] + cd /home/abuild/rpmbuild/BUILD
[ 10s] + /usr/bin/rm -rf
/home/abuild/rpmbuild/BUILDROOT/libyui-qt-graph-2.44.1-1.x86_64
[ 10s] ++ dirname
/home/abuild/rpmbuild/BUILDROOT/libyui-qt-graph-2.44.1-1.x86_64
[ 10s] + /usr/bin/mkdir -p /home/abuild/rpmbuild/BUILDROOT
[ 10s] + /usr/bin/mkdir
/home/abuild/rpmbuild/BUILDROOT/libyui-qt-graph-2.44.1-1.x86_64
[ 10s] + cd libyui-qt-graph-2.44.1
[ 10s] + export 'CFLAGS=-fmessage-length=0 -grecord-gcc-switches -O2 -Wall
-D_FORTIFY_SOURCE=2 -fstack-protector -funwind-tables
-fasynchronous-unwind-tables -DNDEBUG'
[ 10s] + CFLAGS='-fmessage-length=0 -grecord-gcc-switches -O2 -Wall
-D_FORTIFY_SOURCE=2 -fstack-protector -funwind-tables
-fasynchronous-unwind-tables -DNDEBUG'
[ 10s] + export 'CXXFLAGS=-fmessage-length=0 -grecord-gcc-switches -O2 -Wall
-D_FORTIFY_SOURCE=2 -fstack-protector -funwind-tables
-fasynchronous-unwind-tables -DNDEBUG'
[ 10s] + CXXFLAGS='-fmessage-length=0 -grecord-gcc-switches -O2 -Wall
-D_FORTIFY_SOURCE=2 -fstack-protector -funwind-tables
-fasynchronous-unwind-tables -DNDEBUG'
[ 10s] + ./bootstrap.sh /usr
[ 10s] checking for /usr/share/libyui/buildtools/CMakeLists.common...
[ 10s] OK: linked to
/home/abuild/rpmbuild/BUILD/libyui-qt-graph-2.44.1/./CMakeLists.txt.
[ 10s] + mkdir build
[ 10s] + cd build
[ 10s] + cmake .. -DPREFIX=/usr -DDOC_DIR=/usr/share/doc/packages
-DLIB_DIR=lib64 -DCMAKE_BUILD_TYPE=RELEASE
[ 10s] -- The C compiler identification is GNU 4.8.2
[ 10s] -- The CXX compiler identification is GNU 4.8.2
[ 10s] -- Check for working C compiler: /usr/bin/cc
[ 10s] -- Check for working C compiler: /usr/bin/cc -- works
[ 10s] -- Detecting C compiler ABI info
[ 10s] -- Detecting C compiler ABI info - done
[ 10s] -- Check for working CXX compiler: /usr/bin/c++
[ 10s] -- Check for working CXX compiler: /usr/bin/c++ -- works
[ 10s] -- Detecting CXX compiler ABI info
[ 11s] -- Detecting CXX compiler ABI info - done
[ 11s] -- Found Libyui: (Version: 3.0.13)
[ 11s] -- Found Libyui-qt: (Version: 2.44.0)
[ 11s] -- gvc found
[ 11s] -- cgraph found
[ 11s] -- cdt found
[ 11s] -- USE_C_STD not set, defaulting to gnu99
[ 11s] -- Could NOT find Doxygen (missing: DOXYGEN_EXECUTABLE)
[ 11s] --
[ 11s] --
********************************************************************************
[ 11s] --
[ 11s] -- libyui-qt-graph has been configured with following options:
[ 11s] --
[ 11s] -- Plugin-Name: qt-graph
[ 11s] -- Extension-Name:
[ 11s] -- Library-Dependencies:
Qt5Core;Qt5Gui;Qt5Widgets;Libyui;Libyui-qt
[ 11s] -- Plugin is for use with:
[ 11s] -- targetlib to build: yui-qt-graph
[ 11s] --
[ 11s] -- Version: 2.44.1
[ 11s] -- SO-Version: 6.0.0
[ 11s] --
[ 11s] -- Used Build-Option: RELEASE
[ 11s] -- Used Compiler-Flags: -fmessage-length=0
-grecord-gcc-switches -O2 -Wall -D_FORTIFY_SOURCE=2 -fstack-protector
-funwind-tables -fasynchronous-unwind-tables -DNDEBUG -std=c++0x
-fmessage-length=0 -Wall -Werror -O3
[ 11s] -- linking against: gvc;cgraph;cdt
[ 11s] -- using includes from:
/usr/include/graphviz;/usr/include/yui/qt;/usr/include/yui
[ 11s] --
[ 11s] --
[ 11s] -- Install to Prefix: /usr
[ 11s] -- use Shared-Dir: /usr/share
[ 11s] -- use Library-Dir: /usr/lib64/yui
[ 11s] -- use Include-Dir:
/usr/include/yui/qt-graph
[ 11s] -- use CMake Plugin-InstallDir:
/usr/lib64/cmake/libyui-qt-graph
[ 11s] -- use Doc-Dir:
/usr/share/doc/packages/libyui-qt-graph6
[ 11s] -- Data-Dir: /usr/share/libyui
[ 11s] -- Theme-Dir: /usr/share/libyui/theme
[ 11s] --
[ 11s] -- Disable shared library: OFF
[ 11s] -- Include Debug-Symbols in library: OFF
[ 11s] -- Build a static library, too: OFF
[ 11s] -- Build the examples, too: ON
[ 11s] --
[ 11s] --
********************************************************************************
[ 11s] --
[ 11s] -- Configuring done
[ 11s] -- Generating done
[ 11s] -- Build files have been written to:
/home/abuild/rpmbuild/BUILD/libyui-qt-graph-2.44.1/build
[ 11s] + make -j2
[ 11s] Scanning dependencies of target SimpleCreate
[ 11s] Scanning dependencies of target yui-qt-graph_automoc
[ 11s] [ 12%] [ 25%] Automoc for target yui-qt-graph
[ 11s] Building CXX object
examples/CMakeFiles/SimpleCreate.dir/SimpleCreate.cc.o
[ 11s] Generating QY2Graph.moc
[ 11s] /home/abuild/rpmbuild/BUILD/libyui-qt-graph-2.44.1/src/QY2Graph.cc:0:
Note: No relevant classes found. No output generated.
[ 11s] Generating YQGraph.moc
[ 11s] /home/abuild/rpmbuild/BUILD/libyui-qt-graph-2.44.1/src/YQGraph.cc:0:
Note: No relevant classes found. No output generated.
[ 11s] Generating moc_QY2Graph.cpp
[ 11s] Generating moc_YQGraph.cpp
[ 11s] [ 25%] Built target yui-qt-graph_automoc
[ 11s] Scanning dependencies of target SimpleLoad
[ 11s] [ 37%] Building CXX object
examples/CMakeFiles/SimpleLoad.dir/SimpleLoad.cc.o
[ 12s] Linking CXX executable SimpleCreate
[ 12s] [ 37%] Built target SimpleCreate
[ 12s] Scanning dependencies of target yui-qt-graph
[ 12s] [ 50%] Building CXX object
src/CMakeFiles/yui-qt-graph.dir/QY2Graph.cc.o
[ 12s] Linking CXX executable SimpleLoad
[ 12s] [ 50%] Built target SimpleLoad
[ 12s] [ 62%] Building CXX object src/CMakeFiles/yui-qt-graph.dir/YQGraph.cc.o
[ 12s] In file included from
/home/abuild/rpmbuild/BUILD/libyui-qt-graph-2.44.1/src/YQGraph.cc:34:0:
[ 12s] /usr/include/yui/qt/YQApplication.h:29:24: fatal error: Qt/qobject.h:
No such file or directory
[ 12s] #include <Qt/qobject.h>
[ 12s] ^
[ 12s] compilation terminated.
[ 12s] src/CMakeFiles/yui-qt-graph.dir/build.make:80: recipe for target
'src/CMakeFiles/yui-qt-graph.dir/YQGraph.cc.o' failed
[ 12s] make[2]: *** [src/CMakeFiles/yui-qt-graph.dir/YQGraph.cc.o] Error 1
[ 12s] make[2]: *** Waiting for unfinished jobs....
[ 14s] CMakeFiles/Makefile2:141: recipe for target
'src/CMakeFiles/yui-qt-graph.dir/all' failed
[ 14s] make[1]: *** [src/CMakeFiles/yui-qt-graph.dir/all] Error 2
[ 14s] Makefile:136: recipe for target 'all' failed
[ 14s] make: *** [all] Error 2
[ 14s] error: Bad exit status from /var/tmp/rpm-tmp.Yn4R31 (%build)
[ 14s]
[ 14s]
[ 14s] RPM build errors:
[ 14s] Bad exit status from /var/tmp/rpm-tmp.Yn4R31 (%build)
Building libyui-qt-graph.spec for openSUSE_Factory/x86_64
Getting buildinfo from server and store to
<http://ci.opensuse.org/job/libyui-qt-graph-master/ws/devel>:libraries:libyui/libyui-qt-graph/.osc/_buildinfo-openSUSE_Factory-x86_64.xml
Getting buildconfig from server and store to
<http://ci.opensuse.org/job/libyui-qt-graph-master/ws/devel>:libraries:libyui/libyui-qt-graph/.osc/_buildconfig-openSUSE_Factory-x86_64
Updating cache of required packages
0.0% cache miss. 323/323 dependencies cached.

Skipping verification of package signatures
Writing build configuration
Running build

The buildroot was: /var/tmp/build-root-openSUSE_Factory
rm -rf devel:libraries:libyui
rake aborted!
Command failed with status (1): [osc build --no-verify --release=1 --root=/...]

Tasks: TOP => osc:build
(See full trace by running task with --trace)
cleaning
Build step 'Execute shell' marked build as failure
--
To unsubscribe, e-mail: libyui-commit+unsubscribe@xxxxxxxxxxxx
To contact the owner, e-mail: libyui-commit+owner@xxxxxxxxxxxx

< Previous Next >
This Thread
Follow Ups
References