Mailinglist Archive: zypp-commit (20 mails)

< Previous Next >
[zypp-commit] Build failed in Jenkins: libzypp-11.4 #576
  • From: hudson@xxxxxxx
  • Date: Mon, 16 Jan 2012 17:05:30 +0100 (CET)
  • Message-id: <1697272024.1721326729930995.JavaMail.jenkins@river>
See <http://river.suse.de/job/libzypp-11.4/576/changes>

Changes:

[Michael Andres] Port previous patch to gcc-4.5

------------------------------------------
Started by user anonymous
Building remotely on node-zypp11.4
Checkout:libzypp-11.4 / <http://river.suse.de/job/libzypp-11.4/ws/> -
hudson.remoting.Channel@53bb112d:node-zypp11.4
Using strategy: Default
Last Built Revision: Revision d8fef3a989d99b36915c00ea292d7bdbe16913a6
(origin/SuSE-Code-11_4-Branch)
Checkout:checkout / <http://river.suse.de/job/libzypp-11.4/ws/checkout> -
hudson.remoting.LocalChannel@7592abae
Fetching changes from the remote Git repository
Fetching upstream changes from git://github.com/openSUSE/libzypp.git
Commencing build of Revision e1177439c2f5501cf09037e6beef2e0fc1e6eba3
(origin/SuSE-Code-11_4-Branch)
Checking out Revision e1177439c2f5501cf09037e6beef2e0fc1e6eba3
(origin/SuSE-Code-11_4-Branch)
[copy-to-slave] Copying '.hudson-scripts/**', excluding nothing, from
'file:/var/lib/jenkins/userContent/' on the master to
'<http://river.suse.de/job/libzypp-11.4/ws/'> on 'node-zypp11.4'.
[libzypp-11.4] $ /bin/sh -xe /tmp/hudson6226985522936108731.sh
+ echo '### BUILD ###'
### BUILD ###
+ echo '==> Reading build configuration'
==> Reading build configuration
+ . .hudson-scripts/base-functions
++ . .hudson-scripts/ascii_art
++ trap 'error_exit $?' ERR
++ echo 'Job running as user: root'
Job running as user: root
+++ date '+%F %T'
++ echo 'Started at: 2012-01-16 15:06:42'
Started at: 2012-01-16 15:06:42
+++ hostname --fqdn
++ export SITENAME=app4
++ SITENAME=app4
++ export TARGET_DIST=11.4
++ TARGET_DIST=11.4
++ export PROJECT=libzypp
++ PROJECT=libzypp
+ . .hudson-scripts/build-functions
+ . .hudson-scripts/obs-functions
++ trap 'error_exit $?' ERR
++ export ALLOW_OBS_SUBMIT=yes
++ ALLOW_OBS_SUBMIT=yes
+ . .hudson-scripts/setup-buildenvironment
++ export RUNTESTS=1
++ RUNTESTS=1
++ export ICEJOBS=4
++ ICEJOBS=4
++ export CMAKE_INSTALL_PREFIX=/usr
++ CMAKE_INSTALL_PREFIX=/usr
+++ uname -m
+++ hostname -f
++ export 'CMAKEPARAS=-DBUILDNAME=x86_64 -DSITE=app4
-DCMAKE_INSTALL_PREFIX=/usr'
++ CMAKEPARAS='-DBUILDNAME=x86_64 -DSITE=app4 -DCMAKE_INSTALL_PREFIX=/usr'
++ export ICECCDIR=<http://river.suse.de/job/libzypp-11.4/ws/ICECC>
++ ICECCDIR=<http://river.suse.de/job/libzypp-11.4/ws/ICECC>
++ echo 'Configuring cmake for Icecream ...'
Configuring cmake for Icecream ...
++ rm -rf <http://river.suse.de/job/libzypp-11.4/ws/ICECC>
++ mkdir -p <http://river.suse.de/job/libzypp-11.4/ws/ICECC>
++ pushd <http://river.suse.de/job/libzypp-11.4/ws/ICECC>
~/hudson/workspace/libzypp-11.4/ICECC ~/hudson/workspace/libzypp-11.4
+++ icecc --build-native
+++ tail -1
+++ grep .tar.gz
+++ sed -e 's/creating //'
++ export ICECC_ENV=d2c9e515f28630c59306721a3045cc2c.tar.gz
++ ICECC_ENV=d2c9e515f28630c59306721a3045cc2c.tar.gz
++ export ICECC_ENV=d2c9e515f28630c59306721a3045cc2c.tar.gz
++ ICECC_ENV=d2c9e515f28630c59306721a3045cc2c.tar.gz
++ export
ICECC_VERSION=<http://river.suse.de/job/libzypp-11.4/ws/ICECC/d2c9e515f28630c59306721a3045cc2c.tar.gz>
++
ICECC_VERSION=<http://river.suse.de/job/libzypp-11.4/ws/ICECC/d2c9e515f28630c59306721a3045cc2c.tar.gz>
++ popd
~/hudson/workspace/libzypp-11.4
++ pushd <http://river.suse.de/job/libzypp-11.4/ws/>
~/hudson/workspace/libzypp-11.4 ~/hudson/workspace/libzypp-11.4
++ export ICECREAM=-DCMAKE_CXX_COMPILER=/opt/icecream/bin/g++
++ ICECREAM=-DCMAKE_CXX_COMPILER=/opt/icecream/bin/g++
++ export CXX=/opt/icecream/bin/g++
++ CXX=/opt/icecream/bin/g++
++ export 'MAKECMD=make -j 4'
++ MAKECMD='make -j 4'
++ export MAKEBIN=make
++ MAKEBIN=make
++ export
PATH=/opt/icecream/bin:/usr/lib64/mpi/gcc/openmpi/bin:/sbin:/usr/sbin:/usr/local/sbin:/root/bin:/usr/local/bin:/usr/bin:/bin:/usr/X11R6/bin:/usr/games
++
PATH=/opt/icecream/bin:/usr/lib64/mpi/gcc/openmpi/bin:/sbin:/usr/sbin:/usr/local/sbin:/root/bin:/usr/local/bin:/usr/bin:/bin:/usr/X11R6/bin:/usr/games
++ popd
~/hudson/workspace/libzypp-11.4
++ export CHECKOUTDIR=<http://river.suse.de/job/libzypp-11.4/ws/checkout>
++ CHECKOUTDIR=<http://river.suse.de/job/libzypp-11.4/ws/checkout>
++ export BUILDDIR=<http://river.suse.de/job/libzypp-11.4/ws/build>
++ BUILDDIR=<http://river.suse.de/job/libzypp-11.4/ws/build>
++ export PACKAGEDIR=<http://river.suse.de/job/libzypp-11.4/ws/build/package>
++ PACKAGEDIR=<http://river.suse.de/job/libzypp-11.4/ws/build/package>
++ export
ARTIFACTS=<http://river.suse.de/job/libzypp-11.4/576/artifact/.artifacts>
++ ARTIFACTS=<http://river.suse.de/job/libzypp-11.4/576/artifact/.artifacts>
++ export OBSDIR=<http://river.suse.de/job/libzypp-11.4/ws/OBS>
++ OBSDIR=<http://river.suse.de/job/libzypp-11.4/ws/OBS>
++ export RPMTOPDIR=<http://river.suse.de/job/libzypp-11.4/ws/rpm>
++ RPMTOPDIR=<http://river.suse.de/job/libzypp-11.4/ws/rpm>
++ export RPMOUT=<http://river.suse.de/job/libzypp-11.4/ws/rpm/rpms>
++ RPMOUT=<http://river.suse.de/job/libzypp-11.4/ws/rpm/rpms>
++ export RPMBUILDDIR=<http://river.suse.de/job/libzypp-11.4/ws/rpm/rpmbuild>
++ RPMBUILDDIR=<http://river.suse.de/job/libzypp-11.4/ws/rpm/rpmbuild>
++ export
RPMBUILDROOT=<http://river.suse.de/job/libzypp-11.4/ws/rpm/rpmbuildroot>
++ RPMBUILDROOT=<http://river.suse.de/job/libzypp-11.4/ws/rpm/rpmbuildroot>
++ rm -rf <http://river.suse.de/job/libzypp-11.4/ws/rpm/rpms>
++ rm -rf <http://river.suse.de/job/libzypp-11.4/ws/rpm/rpmbuild>
++ rm -rf <http://river.suse.de/job/libzypp-11.4/ws/rpm/rpmbuildroot>
++ rm -rf <http://river.suse.de/job/libzypp-11.4/576/artifact/.artifacts>
++ rm -rf <http://river.suse.de/job/libzypp-11.4/ws/OBS>
++ rm -rf '<http://river.suse.de/job/libzypp-11.4/ws/copy-to-slave*.dir'>
++ [[ '' == 1 ]]
++ rm -rf <http://river.suse.de/job/libzypp-11.4/ws/build>
++ mkdir -p <http://river.suse.de/job/libzypp-11.4/ws/build>
++ mkdir -p <http://river.suse.de/job/libzypp-11.4/ws/rpm>
++ mkdir -p <http://river.suse.de/job/libzypp-11.4/ws/rpm/rpms>
++ mkdir -p <http://river.suse.de/job/libzypp-11.4/ws/rpm/rpmbuild>
++ mkdir -p <http://river.suse.de/job/libzypp-11.4/ws/rpm/rpmbuildroot>
++ mkdir -p <http://river.suse.de/job/libzypp-11.4/576/artifact/.artifacts>
++ mkdir -p <http://river.suse.de/job/libzypp-11.4/ws/OBS>
++ cat
+ build_cmake
+ echo '==> Building'
==> Building
+ pushd <http://river.suse.de/job/libzypp-11.4/ws/build>
~/hudson/workspace/libzypp-11.4/build ~/hudson/workspace/libzypp-11.4
+ cmake -DBUILDNAME=x86_64 -DSITE=app4 -DCMAKE_INSTALL_PREFIX=/usr
-DCMAKE_CXX_COMPILER=/opt/icecream/bin/g++
<http://river.suse.de/job/libzypp-11.4/ws/checkout>
-- The C compiler identification is GNU
-- The CXX compiler identification is GNU
-- Check for working C compiler: /opt/icecream/bin/gcc
-- Check for working C compiler: /opt/icecream/bin/gcc -- works
-- Detecting C compiler ABI info
-- Detecting C compiler ABI info - done
-- Check for working CXX compiler: /opt/icecream/bin/g++
-- Check for working CXX compiler: /opt/icecream/bin/g++ -- works
-- Detecting CXX compiler ABI info
-- Detecting CXX compiler ABI info - done
-- Libraries will be installed in /usr/lib64
-- Config files will be installed in /etc
** Manual files will be installed in /usr/share/man
-- Writing spec file...
-- I hate you rpm-lint...!!!
-- rpm found: includes in /usr/include, library in /usr/lib64/librpm.so
(suspect 4.x)
-- rpm found: enable rpm-4.4 legacy interface.
-- Boost version: 1.44.0
-- boost found: includes in /usr/include, library in /usr/lib
-- Found Gettext:
-- curl found: includes in /usr/include, library in /usr/lib64/libcurl.so
-- libxml found: includes in /usr/include, library in /usr/lib64/libxml2.so
-- Found ZLIB: /usr/include (found version "1.2.5")
-- satsolver found: includes in /usr/include, library in
/usr/lib64/libsatsolver.a /usr/lib64/libsatsolverext.a
-- Found EXPAT: /usr/lib64/libexpat.so
-- Found libcrypto: /usr/lib64/libcrypto.so
-- Found OpenSSL: /usr/lib64/libssl.so
-- Found Udev: /usr/lib64/libudev.so
-- Found libproxy: /usr/lib64/libproxy.so
-- doxygen found: /usr/bin/doxygen
-- soname: 810.3.2
-- version: 8.13.2
-- Writing pkg-config file...
-- FindZypp.cmake will be installed in /usr/share/cmake/Modules
-- zypp.conf will be installed in /etc/zypp
-- systemCheck will be installed in /etc/zypp
-- zsync not found
CMake Warning at devel/devel.ma/CMakeLists.txt:9 (MESSAGE):
qt3 not found


-- Translation set: zypp-po.tar.bz2
-- Translations:
sk.po;sl.po;el.po;tr.po;ja.po;ru.po;es.po;km.po;th.po;wa.po;en_GB.po;lt.po;be.po;ko.po;hr.po;sr.po;hi.po;en_US.po;mk.po;af.po;ta.po;fi.po;pl.po;uk.po;vi.po;cy.po;bn.po;zh_TW.po;id.po;de.po;sv.po;zu.po;si.po;zh_CN.po;da.po;nb.po;hu.po;et.po;cs.po;ar.po;mr.po;gu.po;ka.po;ca.po;nl.po;lo.po;he.po;gl.po;fr.po;pa.po;tg.po;it.po;ro.po;nds.po;xh.po;bg.po;pt_BR.po;bs.po;pt.po;
-- Configuring done
-- Generating done
-- Build files have been written to:
<http://river.suse.de/job/libzypp-11.4/ws/build>
+ make -j 4
Scanning dependencies of target mongoose
[ 1%] Building C object vendor/mongoose/CMakeFiles/mongoose.dir/mongoose.c.o
Linking C static library libmongoose.a
[ 1%] Built target mongoose
Scanning dependencies of target zypp
[ 1%] [ 1%] [ 3%] [ 3%] Building CXX object
zypp/CMakeFiles/zypp.dir/misc/DefaultLoadSystem.cc.o
Building CXX object zypp/CMakeFiles/zypp.dir/pool/GetResolvablesToInsDel.cc.o
Building CXX object zypp/CMakeFiles/zypp.dir/misc/CheckAccessDeleted.cc.o
Building CXX object zypp/CMakeFiles/zypp.dir/pool/PoolImpl.cc.o
In file included from
<http://river.suse.de/job/libzypp-11.4/ws/checkout/zypp/misc/DefaultLoadSystem.cc>:20:0:
<http://river.suse.de/job/libzypp-11.4/ws/checkout/zypp/zypp_detail/ZYppReadOnlyHack.h>:15:2:
warning: #warning ZYPP_ZYPP_DETAIL_ZYPPREADONLYHACK_H
<http://river.suse.de/job/libzypp-11.4/ws/checkout/zypp/misc/CheckAccessDeleted.cc>:
In member function 'zypp::CheckAccessDeleted::size_type
zypp::CheckAccessDeleted::check(bool)':
<http://river.suse.de/job/libzypp-11.4/ws/checkout/zypp/misc/CheckAccessDeleted.cc>:210:11:
error: 'it' was not declared in this scope
<http://river.suse.de/job/libzypp-11.4/ws/checkout/zypp/misc/CheckAccessDeleted.cc>:210:48:
error: expected ';' before ')' token
<http://river.suse.de/job/libzypp-11.4/ws/checkout/zypp/misc/CheckAccessDeleted.cc>:214:22:
error: could not convert
'((zypp::CheckAccessDeleted*)this)->zypp::CheckAccessDeleted::_data.std::vector<_Tp,
_Alloc>::swap [with _Tp = zypp::CheckAccessDeleted::ProcInfo, _Alloc =
std::allocator<zypp::CheckAccessDeleted::ProcInfo>, std::vector<_Tp, _Alloc> =
std::vector<zypp::CheckAccessDeleted::ProcInfo>](((std::vector<zypp::CheckAccessDeleted::ProcInfo>&)(&
data)))' to 'bool'
<http://river.suse.de/job/libzypp-11.4/ws/checkout/zypp/misc/CheckAccessDeleted.cc>:215:5:
error: expected primary-expression before 'return'
<http://river.suse.de/job/libzypp-11.4/ws/checkout/zypp/misc/CheckAccessDeleted.cc>:215:5:
error: expected ')' before 'return'
<http://river.suse.de/job/libzypp-11.4/ws/checkout/zypp/misc/CheckAccessDeleted.cc>:216:3:
warning: control reaches end of non-void function
ICECC[15780] 15:06:53: Compiled on 10.11.1.109
make[2]: *** [zypp/CMakeFiles/zypp.dir/misc/CheckAccessDeleted.cc.o] Error 1
make[2]: *** Waiting for unfinished jobs....
<http://river.suse.de/job/libzypp-11.4/ws/checkout/zypp/misc/DefaultLoadSystem.cc>:
In function 'void zypp::misc::defaultLoadSystem(const
zypp::filesystem::Pathname&, zypp::misc::LoadSystemFlags)':
<http://river.suse.de/job/libzypp-11.4/ws/checkout/zypp/misc/DefaultLoadSystem.cc>:48:29:
warning: 'void zypp::zypp_readonly_hack::IWantIt()' is deprecated (declared at
<http://river.suse.de/job/libzypp-11.4/ws/checkout/zypp/zypp_detail/ZYppReadOnlyHack.h>:26)
<http://river.suse.de/job/libzypp-11.4/ws/checkout/zypp/misc/DefaultLoadSystem.cc>:48:38:
warning: 'void zypp::zypp_readonly_hack::IWantIt()' is deprecated (declared at
<http://river.suse.de/job/libzypp-11.4/ws/checkout/zypp/zypp_detail/ZYppReadOnlyHack.h>:26)
make[1]: *** [zypp/CMakeFiles/zypp.dir/all] Error 2
make: *** [all] Error 2
Build step 'Execute shell' marked build as failure
Archiving artifacts

--
To unsubscribe, e-mail: zypp-commit+unsubscribe@xxxxxxxxxxxx
For additional commands, e-mail: zypp-commit+help@xxxxxxxxxxxx

< Previous Next >
This Thread
Follow Ups
References