Mailinglist Archive: zypp-commit (20 mails)

< Previous Next >
[zypp-commit] Build failed in Jenkins: libzypp-HEAD #1073
  • From: hudson@xxxxxxx
  • Date: Mon, 9 Jan 2012 17:22:34 +0100 (CET)
  • Message-id: <82604873.151326126154216.JavaMail.jenkins@river>
See <http://river.suse.de/job/libzypp-HEAD/1073/changes>

Changes:

[Michael Schroeder] - adapt to libsolv interface changes, part 1

------------------------------------------
[...truncated 136 lines...]
-- Performing Test CC_FORMAT_SECURITY - Failed
-- Performing Test CXX_FORMAT_SECURITY
-- Performing Test CXX_FORMAT_SECURITY - Failed
-- Looking for pipe2
-- Looking for pipe2 - found
-- Writing spec file...
-- I hate you rpm-lint...!!!
CMake Warning at /usr/share/cmake/Modules/CPack.cmake:236 (MESSAGE):
CPack.cmake has already been included!!
Call Stack (most recent call first):
CMakeLists.txt:55 (INCLUDE)


-- rpm found: includes in /usr/include, library in /usr/lib64/librpm.so
(suspect 4.x)
-- rpm found: use rpm-4.x interface.
-- Boost version: 1.46.1
-- Found the following Boost libraries:
-- program_options
-- unit_test_framework
-- boost found: includes in /usr/include, library in /usr/lib64
-- Found Gettext:
-- curl found: includes in /usr/include, library in /usr/lib64/libcurl.so
-- libxml found: includes in /usr/include, library in /usr/lib64/libxml2.so
-- Found ZLIB: /usr/lib64/libz.so (found version "1.2.5.2")
-- Found LibSolv: /usr/lib64/libsolv.so
-- Found LibSolv_ext: /usr/lib64/libsolvext.so
-- Found LibSolv: /usr/include /usr/lib64/libsolv.so;/usr/lib64/libsolvext.so
-- Found EXPAT: /usr/lib64/libexpat.so
-- Found libcrypto: /usr/lib64/libcrypto.so
-- Found OpenSSL: /usr/lib64/libssl.so
-- Looking for udev_enumerate_new
-- Looking for udev_enumerate_new - found
-- Found Udev: /usr/lib64/libudev.so
-- checking for one of the modules 'libproxy-1.0'
-- doxygen found: /usr/bin/doxygen
-- soname: 1100.0.0
-- version: 11.0.0
-- Writing pkg-config file...
-- FindZypp.cmake will be installed in /usr/share/cmake/Modules
-- zypp.conf will be installed in /etc/zypp
-- systemCheck will be installed in /etc/zypp
-- zsync not found
-- Could NOT find Qt3 (missing: QT_QT_LIBRARY QT_INCLUDE_DIR)
CMake Warning at devel/devel.ma/CMakeLists.txt:9 (MESSAGE):
qt3 not found


-- Translation set: zypp-po.tar.bz2
-- Translations:
sk.po;sl.po;el.po;tr.po;ja.po;ru.po;es.po;km.po;th.po;wa.po;en_GB.po;lt.po;be.po;ko.po;hr.po;sr.po;hi.po;en_US.po;mk.po;af.po;ta.po;fi.po;pl.po;uk.po;vi.po;cy.po;bn.po;zh_TW.po;id.po;de.po;sv.po;zu.po;si.po;zh_CN.po;da.po;nb.po;hu.po;et.po;cs.po;ar.po;mr.po;gu.po;ka.po;ca.po;nl.po;lo.po;he.po;gl.po;fr.po;pa.po;tg.po;it.po;ro.po;nds.po;xh.po;nn.po;bg.po;pt_BR.po;bs.po;pt.po;
-- Configuring done
-- Generating done
-- Build files have been written to:
<http://river.suse.de/job/libzypp-HEAD/ws/build>
+ make -j 10
Scanning dependencies of target mongoose
[ 1%] Building C object vendor/mongoose/CMakeFiles/mongoose.dir/mongoose.c.o
Linking C static library libmongoose.a
[ 1%] Built target mongoose
Scanning dependencies of target zypp
[ 1%] [ 3%] [ 3%] [ 3%] Building CXX object
zypp/CMakeFiles/zypp.dir/misc/CheckAccessDeleted.cc.o
Building CXX object zypp/CMakeFiles/zypp.dir/misc/DefaultLoadSystem.cc.o
Building CXX object zypp/CMakeFiles/zypp.dir/pool/GetResolvablesToInsDel.cc.o
[ 4%] Building CXX object zypp/CMakeFiles/zypp.dir/pool/PoolImpl.cc.o
[ 4%] [ 4%] Building CXX object zypp/CMakeFiles/zypp.dir/pool/PoolStats.cc.o
Building CXX object
zypp/CMakeFiles/zypp.dir/parser/susetags/ContentFileReader.cc.o
[ 4%] [ 6%] Building CXX object
zypp/CMakeFiles/zypp.dir/parser/susetags/RepoIndex.cc.o
[ 6%] Building CXX object zypp/CMakeFiles/zypp.dir/parser/xml/ParseDef.cc.o
Building CXX object zypp/CMakeFiles/zypp.dir/parser/xml/Node.cc.o
Building CXX object zypp/CMakeFiles/zypp.dir/parser/xml/ParseDefConsume.cc.o
In file included from
<http://river.suse.de/job/libzypp-HEAD/ws/checkout/zypp/misc/DefaultLoadSystem.cc>:20:0:
<http://river.suse.de/job/libzypp-HEAD/ws/checkout/zypp/zypp_detail/ZYppReadOnlyHack.h>:15:2:
warning: #warning ZYPP_ZYPP_DETAIL_ZYPPREADONLYHACK_H [-Wcpp]
[ 6%] Building CXX object
zypp/CMakeFiles/zypp.dir/parser/xml/ParseDefException.cc.o
[ 6%] Building CXX object zypp/CMakeFiles/zypp.dir/parser/xml/Reader.cc.o
ICECC[22020] 17:22:03: got exception 17 (10.11.0.42)
[ 8%] Building CXX object zypp/CMakeFiles/zypp.dir/parser/xml/XmlString.cc.o
ICECC[22008] 17:22:03: got exception 17 (10.11.0.42)
[ 8%] Building CXX object zypp/CMakeFiles/zypp.dir/parser/xml/libxmlfwd.cc.o
[ 8%] Building CXX object
zypp/CMakeFiles/zypp.dir/parser/xml/xml_escape_parser.cpp.o
[ 8%] Building CXX object
zypp/CMakeFiles/zypp.dir/parser/yum/RepomdFileReader.cc.o
[ 9%]
<http://river.suse.de/job/libzypp-HEAD/ws/checkout/zypp/misc/DefaultLoadSystem.cc>:
In function 'void zypp::misc::defaultLoadSystem(const
zypp::filesystem::Pathname&, zypp::misc::LoadSystemFlags)':
<http://river.suse.de/job/libzypp-HEAD/ws/checkout/zypp/misc/DefaultLoadSystem.cc>:48:29:
warning: 'void zypp::zypp_readonly_hack::IWantIt()' is deprecated (declared at
<http://river.suse.de/job/libzypp-HEAD/ws/checkout/zypp/zypp_detail/ZYppReadOnlyHack.h>:26)
[-Wdeprecated-declarations]
<http://river.suse.de/job/libzypp-HEAD/ws/checkout/zypp/misc/DefaultLoadSystem.cc>:48:38:
warning: 'void zypp::zypp_readonly_hack::IWantIt()' is deprecated (declared at
<http://river.suse.de/job/libzypp-HEAD/ws/checkout/zypp/zypp_detail/ZYppReadOnlyHack.h>:26)
[-Wdeprecated-declarations]
Building CXX object zypp/CMakeFiles/zypp.dir/parser/yum/PatchesFileReader.cc.o
[ 9%] [ 9%] Building CXX object
zypp/CMakeFiles/zypp.dir/parser/plaindir/RepoParser.cc.o
Building CXX object
zypp/CMakeFiles/zypp.dir/parser/ws/WebpinResultFileReader.cc.o
In file included from
<http://river.suse.de/job/libzypp-HEAD/ws/checkout/zypp/pool/GetResolvablesToInsDel.cc>:19:0:
<http://river.suse.de/job/libzypp-HEAD/ws/checkout/zypp/pool/GetResolvablesToInsDel.h>:65:87:
warning: 'GetResolvablesToInsDel' is deprecated [-Wdeprecated-declarations]
<http://river.suse.de/job/libzypp-HEAD/ws/checkout/zypp/pool/GetResolvablesToInsDel.cc>:351:87:
warning: 'GetResolvablesToInsDel' is deprecated [-Wdeprecated-declarations]
[ 11%] [ 11%] [ 11%] Building CXX object
zypp/CMakeFiles/zypp.dir/parser/ParseException.cc.o
Building CXX object zypp/CMakeFiles/zypp.dir/parser/IniParser.cc.o
Building CXX object zypp/CMakeFiles/zypp.dir/parser/IniDict.cc.o
[ 11%] Building CXX object zypp/CMakeFiles/zypp.dir/parser/HistoryLogReader.cc.o
[ 11%] Building CXX object zypp/CMakeFiles/zypp.dir/parser/RepoFileReader.cc.o
[ 13%] Building CXX object
zypp/CMakeFiles/zypp.dir/parser/RepoindexFileReader.cc.o
[ 13%] [ 13%] Building CXX object
zypp/CMakeFiles/zypp.dir/parser/ServiceFileReader.cc.o
Building CXX object zypp/CMakeFiles/zypp.dir/parser/ProductFileReader.cc.o
[ 13%] Building CXX object
zypp/CMakeFiles/zypp.dir/media/proxyinfo/ProxyInfoSysconfig.cc.o
ICECC[22133] 17:22:06: got exception 17 (10.11.0.42)
[ 14%] Building CXX object
zypp/CMakeFiles/zypp.dir/media/proxyinfo/ProxyInfoLibproxy.cc.o
[ 14%] Building CXX object zypp/CMakeFiles/zypp.dir/media/MediaException.cc.o
[ 14%] Building CXX object zypp/CMakeFiles/zypp.dir/media/MediaAccess.cc.o
[ 14%] [ 16%] Building CXX object
zypp/CMakeFiles/zypp.dir/media/MediaHandler.cc.o
Building CXX object zypp/CMakeFiles/zypp.dir/media/Mount.cc.o
[ 16%] Building CXX object zypp/CMakeFiles/zypp.dir/media/MediaNFS.cc.o
<http://river.suse.de/job/libzypp-HEAD/ws/checkout/zypp/media/MediaHandler.cc>:398:2:
warning: #warning Use class TmpDir from TmpPath.h [-Wcpp]
[ 16%] Building CXX object zypp/CMakeFiles/zypp.dir/media/MediaCD.cc.o
[ 16%] Building CXX object zypp/CMakeFiles/zypp.dir/media/MediaDIR.cc.o
[ 18%] Building CXX object zypp/CMakeFiles/zypp.dir/media/MediaDISK.cc.o
[ 18%] Building CXX object zypp/CMakeFiles/zypp.dir/media/MediaCIFS.cc.o
[ 18%] Building CXX object zypp/CMakeFiles/zypp.dir/media/ProxyInfo.cc.o
[ 18%] Building CXX object zypp/CMakeFiles/zypp.dir/media/MediaCurl.cc.o
[ 19%] Building CXX object zypp/CMakeFiles/zypp.dir/media/MediaMultiCurl.cc.o
[ 19%] Building CXX object zypp/CMakeFiles/zypp.dir/media/MediaAria2c.cc.o
[ 19%] Building CXX object zypp/CMakeFiles/zypp.dir/media/MediaISO.cc.o
[ 19%] Building CXX object zypp/CMakeFiles/zypp.dir/media/MediaPlugin.cc.o
[ 21%] Building CXX object zypp/CMakeFiles/zypp.dir/media/MediaSource.cc.o
[ 21%] Building CXX object zypp/CMakeFiles/zypp.dir/media/MediaManager.cc.o
[ 21%] Building CXX object zypp/CMakeFiles/zypp.dir/media/MediaUserAuth.cc.o
[ 21%] Building CXX object
zypp/CMakeFiles/zypp.dir/media/CredentialFileReader.cc.o
[ 22%] [ 22%] Building CXX object
zypp/CMakeFiles/zypp.dir/media/CredentialManager.cc.o
Building CXX object zypp/CMakeFiles/zypp.dir/media/CurlConfig.cc.o
[ 22%] Building CXX object zypp/CMakeFiles/zypp.dir/media/TransferSettings.cc.o
[ 22%] [ 24%] Building CXX object
zypp/CMakeFiles/zypp.dir/media/MediaPriority.cc.o
Building CXX object zypp/CMakeFiles/zypp.dir/media/MetaLinkParser.cc.o
[ 24%] Building CXX object zypp/CMakeFiles/zypp.dir/media/ZsyncParser.cc.o
[ 24%] Building CXX object zypp/CMakeFiles/zypp.dir/media/MediaBlockList.cc.o
[ 24%] Building CXX object zypp/CMakeFiles/zypp.dir/media/UrlResolverPlugin.cc.o
[ 26%] Building CXX object zypp/CMakeFiles/zypp.dir/url/UrlUtils.cc.o
[ 26%] Building CXX object zypp/CMakeFiles/zypp.dir/url/UrlBase.cc.o
[ 26%] Building CXX object zypp/CMakeFiles/zypp.dir/repo/RepoException.cc.o
[ 26%] Building CXX object zypp/CMakeFiles/zypp.dir/repo/RepoMirrorList.cc.o
[ 27%] Building CXX object zypp/CMakeFiles/zypp.dir/repo/RepoType.cc.o
[ 27%] Building CXX object zypp/CMakeFiles/zypp.dir/repo/ServiceType.cc.o
[ 27%] Building CXX object zypp/CMakeFiles/zypp.dir/repo/PackageProvider.cc.o
[ 29%] Building CXX object zypp/CMakeFiles/zypp.dir/repo/SrcPackageProvider.cc.o
[ 29%] Building CXX object zypp/CMakeFiles/zypp.dir/repo/RepoProvideFile.cc.o
[ 29%] [ 29%] [ 31%] Building CXX object
zypp/CMakeFiles/zypp.dir/repo/DeltaCandidates.cc.o
Building CXX object zypp/CMakeFiles/zypp.dir/repo/Applydeltarpm.cc.o
Building CXX object zypp/CMakeFiles/zypp.dir/repo/PackageDelta.cc.o
[ 31%] Building CXX object zypp/CMakeFiles/zypp.dir/repo/SUSEMediaVerifier.cc.o
[ 31%] [ 31%] Building CXX object
zypp/CMakeFiles/zypp.dir/repo/MediaInfoDownloader.cc.o
Building CXX object zypp/CMakeFiles/zypp.dir/repo/Downloader.cc.o
[ 32%] Building CXX object zypp/CMakeFiles/zypp.dir/repo/RepoVariables.cc.o
[ 32%] Building CXX object zypp/CMakeFiles/zypp.dir/repo/RepoInfoBase.cc.o
[ 32%] Building CXX object zypp/CMakeFiles/zypp.dir/repo/PluginServices.cc.o
<http://river.suse.de/job/libzypp-HEAD/ws/checkout/zypp/repo/SUSEMediaVerifier.cc>:58:2:
warning: #warning check the stream status [-Wcpp]
[ 32%] Building CXX object zypp/CMakeFiles/zypp.dir/repo/ServiceRepos.cc.o
[ 34%] Building CXX object zypp/CMakeFiles/zypp.dir/repo/yum/Downloader.cc.o
[ 34%] Building CXX object zypp/CMakeFiles/zypp.dir/repo/yum/ResourceType.cc.o
[ 34%] Building CXX object
zypp/CMakeFiles/zypp.dir/repo/susetags/Downloader.cc.o
[ 34%] Building CXX object zypp/CMakeFiles/zypp.dir/target/rpm/BinHeader.cc.o
[ 36%] Building CXX object zypp/CMakeFiles/zypp.dir/target/rpm/RpmCallbacks.cc.o
[ 36%] [ 36%]
<http://river.suse.de/job/libzypp-HEAD/ws/checkout/zypp/repo/yum/Downloader.cc>:147:2:
warning: #warning Do we need SignatureFileChecker(string descr)? [-Wcpp]
[ 36%] Building CXX object zypp/CMakeFiles/zypp.dir/target/rpm/RpmDb.cc.o
Building CXX object zypp/CMakeFiles/zypp.dir/target/rpm/RpmException.cc.o
Building CXX object zypp/CMakeFiles/zypp.dir/target/rpm/RpmHeader.cc.o
<http://river.suse.de/job/libzypp-HEAD/ws/checkout/zypp/target/rpm/RpmHeader.cc>:391:2:
warning: #warning CHECK IF FILE REQUIRES HANDLING IS OBSOLETE [-Wcpp]
[ 37%] [ 37%] Building CXX object
zypp/CMakeFiles/zypp.dir/target/rpm/librpmDb.cc.o
Building CXX object zypp/CMakeFiles/zypp.dir/target/rpm/librpmDb.cv3.cc.o
[ 37%] Building CXX object
zypp/CMakeFiles/zypp.dir/target/modalias/Modalias.cc.o
[ 37%] [ 39%] Building CXX object
zypp/CMakeFiles/zypp.dir/target/RequestedLocalesFile.cc.o
Building CXX object zypp/CMakeFiles/zypp.dir/target/SoftLocksFile.cc.o
<http://river.suse.de/job/libzypp-HEAD/ws/checkout/zypp/target/rpm/RpmDb.cc>:220:2:
warning: #warning Check for obsolete memebers [-Wcpp]
<http://river.suse.de/job/libzypp-HEAD/ws/checkout/zypp/target/rpm/RpmDb.cc>:388:2:
warning: #warning CHECK: notify root about conversion backup. [-Wcpp]
<http://river.suse.de/job/libzypp-HEAD/ws/checkout/zypp/target/rpm/RpmDb.cc>:646:2:
warning: #warning CHECK: compare vs existing v3 backup. notify root [-Wcpp]
[ 39%] Building CXX object zypp/CMakeFiles/zypp.dir/target/HardLocksFile.cc.o
<http://river.suse.de/job/libzypp-HEAD/ws/checkout/zypp/target/rpm/librpmDb.cc>:681:2:
warning: #warning TESTCASE: rpmdbAppendIterator and (non)sequential access?
[-Wcpp]
<http://river.suse.de/job/libzypp-HEAD/ws/checkout/zypp/target/rpm/librpmDb.cc>:696:2:
warning: #warning TESTCASE: rpmdbGetIteratorCount returns 0 on sequential
access? [-Wcpp]
[ 39%] Building CXX object
zypp/CMakeFiles/zypp.dir/target/CommitPackageCache.cc.o
[ 39%] Building CXX object
zypp/CMakeFiles/zypp.dir/target/CommitPackageCacheImpl.cc.o
[ 40%] Building CXX object
zypp/CMakeFiles/zypp.dir/target/CommitPackageCacheReadAhead.cc.o
[ 40%] Building CXX object
zypp/CMakeFiles/zypp.dir/target/TargetCallbackReceiver.cc.o
[ 40%] Building CXX object zypp/CMakeFiles/zypp.dir/target/TargetException.cc.o
[ 40%] Building CXX object zypp/CMakeFiles/zypp.dir/target/TargetImpl.cc.o
[ 42%] Building CXX object zypp/CMakeFiles/zypp.dir/solver/detail/Helper.cc.o
[ 42%] Building CXX object
zypp/CMakeFiles/zypp.dir/solver/detail/InstallOrder.cc.o
[ 42%] Building CXX object
zypp/CMakeFiles/zypp.dir/solver/detail/ProblemSolutionIgnore.cc.o
<http://river.suse.de/job/libzypp-HEAD/ws/checkout/zypp/target/TargetImpl.cc>:1407:2:
warning: #warning Exception handling [-Wcpp]
[ 42%] Building CXX object
zypp/CMakeFiles/zypp.dir/solver/detail/ProblemSolutionCombi.cc.o
[ 44%] Building CXX object zypp/CMakeFiles/zypp.dir/solver/detail/Resolver.cc.o
[ 44%] Building CXX object
zypp/CMakeFiles/zypp.dir/solver/detail/SolutionAction.cc.o
[ 44%] Building CXX object zypp/CMakeFiles/zypp.dir/solver/detail/Testcase.cc.o
[ 44%] Building CXX object
zypp/CMakeFiles/zypp.dir/solver/detail/SolverQueueItem.cc.o
[ 45%] Building CXX object
zypp/CMakeFiles/zypp.dir/solver/detail/SolverQueueItemInstall.cc.o
[ 45%] Building CXX object
zypp/CMakeFiles/zypp.dir/solver/detail/SolverQueueItemDelete.cc.o
[ 45%] Building CXX object
zypp/CMakeFiles/zypp.dir/solver/detail/SolverQueueItemUpdate.cc.o
[ 45%] Building CXX object
zypp/CMakeFiles/zypp.dir/solver/detail/SolverQueueItemInstallOneOf.cc.o
[ 47%] Building CXX object
zypp/CMakeFiles/zypp.dir/solver/detail/SolverQueueItemLock.cc.o
[ 47%] Building CXX object
zypp/CMakeFiles/zypp.dir/solver/detail/SATResolver.cc.o
In file included from
<http://river.suse.de/job/libzypp-HEAD/ws/checkout/zypp/target/TargetImpl.cc>:50:0:
<http://river.suse.de/job/libzypp-HEAD/ws/checkout/zypp/pool/GetResolvablesToInsDel.h>:65:87:
warning: 'GetResolvablesToInsDel' is deprecated [-Wdeprecated-declarations]
<http://river.suse.de/job/libzypp-HEAD/ws/checkout/zypp/target/TargetImpl.cc>:
In member function 'zypp::ZYppCommitResult
zypp::target::TargetImpl::commit(zypp::ResPool, const zypp::ZYppCommitPolicy&)':
<http://river.suse.de/job/libzypp-HEAD/ws/checkout/zypp/target/TargetImpl.cc>:1300:14:
warning: 'zypp::ZYppCommitResult::_errors' is deprecated (declared at
<http://river.suse.de/job/libzypp-HEAD/ws/checkout/zypp/ZYppCommitResult.h>:181)
[-Wdeprecated-declarations]
<http://river.suse.de/job/libzypp-HEAD/ws/checkout/zypp/target/TargetImpl.cc>:1300:14:
warning: 'zypp::ZYppCommitResult::_errors' is deprecated (declared at
<http://river.suse.de/job/libzypp-HEAD/ws/checkout/zypp/ZYppCommitResult.h>:181)
[-Wdeprecated-declarations]
<http://river.suse.de/job/libzypp-HEAD/ws/checkout/zypp/target/TargetImpl.cc>:1301:14:
warning: 'zypp::ZYppCommitResult::_remaining' is deprecated (declared at
<http://river.suse.de/job/libzypp-HEAD/ws/checkout/zypp/ZYppCommitResult.h>:185)
[-Wdeprecated-declarations]
<http://river.suse.de/job/libzypp-HEAD/ws/checkout/zypp/target/TargetImpl.cc>:1301:14:
warning: 'zypp::ZYppCommitResult::_remaining' is deprecated (declared at
<http://river.suse.de/job/libzypp-HEAD/ws/checkout/zypp/ZYppCommitResult.h>:185)
[-Wdeprecated-declarations]
<http://river.suse.de/job/libzypp-HEAD/ws/checkout/zypp/target/TargetImpl.cc>:1302:14:
warning: 'zypp::ZYppCommitResult::_srcremaining' is deprecated (declared at
<http://river.suse.de/job/libzypp-HEAD/ws/checkout/zypp/ZYppCommitResult.h>:189)
[-Wdeprecated-declarations]
<http://river.suse.de/job/libzypp-HEAD/ws/checkout/zypp/target/TargetImpl.cc>:1302:14:
warning: 'zypp::ZYppCommitResult::_srcremaining' is deprecated (declared at
<http://river.suse.de/job/libzypp-HEAD/ws/checkout/zypp/ZYppCommitResult.h>:189)
[-Wdeprecated-declarations]
<http://river.suse.de/job/libzypp-HEAD/ws/checkout/zypp/target/TargetImpl.cc>:1323:15:
warning: 'zypp::ZYppCommitResult::_remaining' is deprecated (declared at
<http://river.suse.de/job/libzypp-HEAD/ws/checkout/zypp/ZYppCommitResult.h>:185)
[-Wdeprecated-declarations]
<http://river.suse.de/job/libzypp-HEAD/ws/checkout/zypp/target/TargetImpl.cc>:1323:15:
warning: 'zypp::ZYppCommitResult::_remaining' is deprecated (declared at
<http://river.suse.de/job/libzypp-HEAD/ws/checkout/zypp/ZYppCommitResult.h>:185)
[-Wdeprecated-declarations]
<http://river.suse.de/job/libzypp-HEAD/ws/checkout/zypp/target/TargetImpl.cc>:1325:15:
warning: 'zypp::ZYppCommitResult::_srcremaining' is deprecated (declared at
<http://river.suse.de/job/libzypp-HEAD/ws/checkout/zypp/ZYppCommitResult.h>:189)
[-Wdeprecated-declarations]
<http://river.suse.de/job/libzypp-HEAD/ws/checkout/zypp/target/TargetImpl.cc>:1325:15:
warning: 'zypp::ZYppCommitResult::_srcremaining' is deprecated (declared at
<http://river.suse.de/job/libzypp-HEAD/ws/checkout/zypp/ZYppCommitResult.h>:189)
[-Wdeprecated-declarations]
<http://river.suse.de/job/libzypp-HEAD/ws/checkout/zypp/target/TargetImpl.cc>:1331:13:
warning: 'zypp::ZYppCommitResult::_errors' is deprecated (declared at
<http://river.suse.de/job/libzypp-HEAD/ws/checkout/zypp/ZYppCommitResult.h>:181)
[-Wdeprecated-declarations]
<http://river.suse.de/job/libzypp-HEAD/ws/checkout/zypp/target/TargetImpl.cc>:1331:13:
warning: 'zypp::ZYppCommitResult::_errors' is deprecated (declared at
<http://river.suse.de/job/libzypp-HEAD/ws/checkout/zypp/ZYppCommitResult.h>:181)
[-Wdeprecated-declarations]
<http://river.suse.de/job/libzypp-HEAD/ws/checkout/zypp/target/TargetImpl.cc>:1335:14:
warning: 'zypp::ZYppCommitResult::_result' is deprecated (declared at
<http://river.suse.de/job/libzypp-HEAD/ws/checkout/zypp/ZYppCommitResult.h>:177)
[-Wdeprecated-declarations]
<http://river.suse.de/job/libzypp-HEAD/ws/checkout/zypp/target/TargetImpl.cc>:1335:14:
warning: 'zypp::ZYppCommitResult::_result' is deprecated (declared at
<http://river.suse.de/job/libzypp-HEAD/ws/checkout/zypp/ZYppCommitResult.h>:177)
[-Wdeprecated-declarations]
<http://river.suse.de/job/libzypp-HEAD/ws/checkout/zypp/target/TargetImpl.cc>:1335:44:
warning: 'zypp::ZYppCommitResult::_remaining' is deprecated (declared at
<http://river.suse.de/job/libzypp-HEAD/ws/checkout/zypp/ZYppCommitResult.h>:185)
[-Wdeprecated-declarations]
<http://river.suse.de/job/libzypp-HEAD/ws/checkout/zypp/target/TargetImpl.cc>:1335:44:
warning: 'zypp::ZYppCommitResult::_remaining' is deprecated (declared at
<http://river.suse.de/job/libzypp-HEAD/ws/checkout/zypp/ZYppCommitResult.h>:185)
[-Wdeprecated-declarations]
[ 47%] [ 47%] [ 49%] Building CXX object
zypp/CMakeFiles/zypp.dir/solver/detail/SystemCheck.cc.o
Building CXX object zypp/CMakeFiles/zypp.dir/ui/Selectable.cc.o
Building CXX object zypp/CMakeFiles/zypp.dir/ui/SelectableImpl.cc.o
[ 49%] Building CXX object zypp/CMakeFiles/zypp.dir/ui/Status.cc.o
[ 49%] [ 49%] Building CXX object
zypp/CMakeFiles/zypp.dir/ui/UserWantedPackages.cc.o
Building CXX object zypp/CMakeFiles/zypp.dir/thread/Mutex.cc.o
[ 50%] Building CXX object zypp/CMakeFiles/zypp.dir/ws/WebpinResult.cc.o
[ 50%] Building CXX object zypp/CMakeFiles/zypp.dir/ByteCount.cc.o
[ 50%] Building CXX object zypp/CMakeFiles/zypp.dir/Capabilities.cc.o
<http://river.suse.de/job/libzypp-HEAD/ws/checkout/zypp/ui/UserWantedPackages.cc>:130:2:
warning: #warning NEEDS FIX [-Wcpp]
[ 52%] Building CXX object zypp/CMakeFiles/zypp.dir/Capability.cc.o
[ 52%] Building CXX object zypp/CMakeFiles/zypp.dir/CapMatch.cc.o
<http://river.suse.de/job/libzypp-HEAD/ws/checkout/zypp/Capability.cc>:307:2:
warning: #warning MIGRATE TO SAT [-Wcpp]
<http://river.suse.de/job/libzypp-HEAD/ws/checkout/zypp/Capability.cc>:308:2:
warning: #warning TESTCASE [-Wcpp]
[ 52%] [ 52%] Building CXX object zypp/CMakeFiles/zypp.dir/Changelog.cc.o
Building CXX object zypp/CMakeFiles/zypp.dir/CheckSum.cc.o
<http://river.suse.de/job/libzypp-HEAD/ws/checkout/zypp/solver/detail/SATResolver.cc>:
In member function 'bool zypp::solver::detail::SATResolver::solving(const
CapabilitySet&, const CapabilitySet&)':
<http://river.suse.de/job/libzypp-HEAD/ws/checkout/zypp/solver/detail/SATResolver.cc>:531:33:
error: 'Solver' has no member named 'recommendations'
<http://river.suse.de/job/libzypp-HEAD/ws/checkout/zypp/solver/detail/SATResolver.cc>:533:46:
error: 'Solver' has no member named 'recommendations'
<http://river.suse.de/job/libzypp-HEAD/ws/checkout/zypp/solver/detail/SATResolver.cc>:538:33:
error: 'Solver' has no member named 'suggestions'
<http://river.suse.de/job/libzypp-HEAD/ws/checkout/zypp/solver/detail/SATResolver.cc>:540:46:
error: 'Solver' has no member named 'suggestions'
<http://river.suse.de/job/libzypp-HEAD/ws/checkout/zypp/solver/detail/SATResolver.cc>:546:33:
error: 'Solver' has no member named 'orphaned'
<http://river.suse.de/job/libzypp-HEAD/ws/checkout/zypp/solver/detail/SATResolver.cc>:548:46:
error: 'Solver' has no member named 'orphaned'
<http://river.suse.de/job/libzypp-HEAD/ws/checkout/zypp/solver/detail/SATResolver.cc>:
In member function 'void zypp::solver::detail::SATResolver::doUpdate()':
<http://river.suse.de/job/libzypp-HEAD/ws/checkout/zypp/solver/detail/SATResolver.cc>:876:32:
error: 'Solver' has no member named 'decisionq'
<http://river.suse.de/job/libzypp-HEAD/ws/checkout/zypp/solver/detail/SATResolver.cc>:900:11:
error: 'poolItem' was not declared in this scope
<http://river.suse.de/job/libzypp-HEAD/ws/checkout/zypp/solver/detail/SATResolver.cc>:
In member function 'std::string
zypp::solver::detail::SATResolver::SATprobleminfoString(Id, std::string&, Id&)':
<http://river.suse.de/job/libzypp-HEAD/ws/checkout/zypp/solver/detail/SATResolver.cc>:988:10:
warning: enumeration value 'SOLVER_RULE_UNKNOWN' not handled in switch
[-Wswitch]
<http://river.suse.de/job/libzypp-HEAD/ws/checkout/zypp/solver/detail/SATResolver.cc>:988:10:
warning: enumeration value 'SOLVER_RULE_RPM_IMPLICIT_OBSOLETES' not handled in
switch [-Wswitch]
<http://river.suse.de/job/libzypp-HEAD/ws/checkout/zypp/solver/detail/SATResolver.cc>:988:10:
warning: enumeration value 'SOLVER_RULE_FEATURE' not handled in switch
[-Wswitch]
<http://river.suse.de/job/libzypp-HEAD/ws/checkout/zypp/solver/detail/SATResolver.cc>:988:10:
warning: enumeration value 'SOLVER_RULE_CHOICE' not handled in switch
[-Wswitch]
<http://river.suse.de/job/libzypp-HEAD/ws/checkout/zypp/solver/detail/SATResolver.cc>:988:10:
warning: enumeration value 'SOLVER_RULE_LEARNT' not handled in switch
[-Wswitch]
<http://river.suse.de/job/libzypp-HEAD/ws/checkout/zypp/solver/detail/SATResolver.cc>:
In member function 'zypp::ResolverProblemList
zypp::solver::detail::SATResolver::problems()':
<http://river.suse.de/job/libzypp-HEAD/ws/checkout/zypp/solver/detail/SATResolver.cc>:1314:26:
error: 'Solver' has no member named 'distupgrade'
ICECC[22654] 17:22:32: Compiled on 10.11.1.75
make[2]: *** [zypp/CMakeFiles/zypp.dir/solver/detail/SATResolver.cc.o] Error 1
make[2]: *** Waiting for unfinished jobs....
[ 54%] Building CXX object zypp/CMakeFiles/zypp.dir/Date.cc.o
make[1]: *** [zypp/CMakeFiles/zypp.dir/all] Error 2
make: *** [all] Error 2
Build step 'Execute shell' marked build as failure
Archiving artifacts

--
To unsubscribe, e-mail: zypp-commit+unsubscribe@xxxxxxxxxxxx
For additional commands, e-mail: zypp-commit+help@xxxxxxxxxxxx

< Previous Next >
List Navigation
Follow Ups
References