Mailinglist Archive: zypp-commit (11 mails)

< Previous Next >
[zypp-commit] Build failed in Jenkins: libzypp-testsuite-HEAD #243
  • From: hudson@xxxxxxx
  • Date: Fri, 5 Aug 2011 15:39:57 +0200 (CEST)
  • Message-id: <1188488382.411312551597258.JavaMail.jenkins@river>
See <http://river.suse.de/job/libzypp-testsuite-HEAD/243/>

------------------------------------------
[...truncated 172 lines...]
checking whether /opt/icecream/bin/g++ accepts -g... (cached) yes
checking dependency style of /opt/icecream/bin/g++... (cached) gcc3
checking how to run the C++ preprocessor... /opt/icecream/bin/g++ -E
checking how to print strings... printf
checking for a sed that does not truncate output... /usr/bin/sed
checking for grep that handles long lines and -e... /usr/bin/grep
checking for egrep... /usr/bin/grep -E
checking for fgrep... /usr/bin/grep -F
checking for ld used by gcc... /usr/x86_64-suse-linux/bin/ld
checking if the linker (/usr/x86_64-suse-linux/bin/ld) is GNU ld... yes
checking for BSD- or MS-compatible name lister (nm)... /usr/bin/nm -B
checking the name lister (/usr/bin/nm -B) interface... BSD nm
checking whether ln -s works... yes
checking the maximum length of command line arguments... 1572864
checking whether the shell understands some XSI constructs... yes
checking whether the shell understands "+="... yes
checking how to convert x86_64-suse-linux-gnu file names to
x86_64-suse-linux-gnu format... func_convert_file_noop
checking how to convert x86_64-suse-linux-gnu file names to toolchain format...
func_convert_file_noop
checking for /usr/x86_64-suse-linux/bin/ld option to reload object files... -r
checking for objdump... objdump
checking how to recognize dependent libraries... pass_all
checking for dlltool... no
checking how to associate runtime and link libraries... printf %s\n
checking for ar... ar
checking for archiver @FILE support... @
checking for strip... strip
checking for ranlib... ranlib
checking command to parse /usr/bin/nm -B output from gcc object... ok
checking for sysroot... no
checking for mt... mt
checking if mt is a manifest tool... no
checking how to run the C preprocessor... gcc -E
checking for ANSI C header files... yes
checking for sys/types.h... yes
checking for sys/stat.h... yes
checking for stdlib.h... yes
checking for string.h... yes
checking for memory.h... yes
checking for strings.h... yes
checking for inttypes.h... yes
checking for stdint.h... yes
checking for unistd.h... yes
checking for dlfcn.h... yes
checking for objdir... .libs
checking if gcc supports -fno-rtti -fno-exceptions... no
checking for gcc option to produce PIC... -fPIC -DPIC
checking if gcc PIC flag -fPIC -DPIC works... yes
checking if gcc static flag -static works... no
checking if gcc supports -c -o file.o... yes
checking if gcc supports -c -o file.o... (cached) yes
checking whether the gcc linker (/usr/x86_64-suse-linux/bin/ld -m elf_x86_64)
supports shared libraries... yes
checking whether -lc should be explicitly linked in... no
checking dynamic linker characteristics... GNU/Linux ld.so
checking how to hardcode library paths into programs... immediate
checking whether stripping libraries is possible... yes
checking if libtool supports shared libraries... yes
checking whether to build shared libraries... yes
checking whether to build static libraries... no
checking how to run the C++ preprocessor... /opt/icecream/bin/g++ -E
checking for ld used by /opt/icecream/bin/g++... /usr/x86_64-suse-linux/bin/ld
-m elf_x86_64
checking if the linker (/usr/x86_64-suse-linux/bin/ld -m elf_x86_64) is GNU
ld... yes
checking whether the /opt/icecream/bin/g++ linker
(/usr/x86_64-suse-linux/bin/ld -m elf_x86_64) supports shared libraries... yes
checking for /opt/icecream/bin/g++ option to produce PIC... -fPIC -DPIC
checking if /opt/icecream/bin/g++ PIC flag -fPIC -DPIC works... yes
checking if /opt/icecream/bin/g++ static flag -static works... no
checking if /opt/icecream/bin/g++ supports -c -o file.o... yes
checking if /opt/icecream/bin/g++ supports -c -o file.o... (cached) yes
checking whether the /opt/icecream/bin/g++ linker
(/usr/x86_64-suse-linux/bin/ld -m elf_x86_64) supports shared libraries... yes
checking dynamic linker characteristics... (cached) GNU/Linux ld.so
checking how to hardcode library paths into programs... immediate
checking for Enhances in librpm... yes
configure: creating ./config.status
config.status: creating Makefile
config.status: creating libzypp-testsuite-tools.spec
config.status: creating libzypp-testsuite-tools.pc
config.status: creating solver/Makefile
config.status: creating solver/config/Makefile
config.status: creating solver/lib/Makefile
config.status: creating solver/solver.test/Makefile
config.status: creating solver/src/Makefile
config.status: creating solver/single.out/Makefile
config.status: creating config.h
config.status: config.h is unchanged
config.status: executing depfiles commands
config.status: executing libtool commands

Configuration:

PACKAGE: zypp-testsuite-tools
VERSION: 4.2.11

LIBZYPPTESTSUITE_VERSION_INFO:

COMPILER: /opt/icecream/bin/g++
CXXFLAGS: -DFAKE -g -O3 -Wall -Wformat -Woverloaded-virtual
-D_LARGE_FILES=

PREFIX: /usr
LIBDIR: /usr/lib64



+ make -j 4
make all-recursive
make[1]: Entering directory
`<http://river.suse.de/job/libzypp-testsuite-HEAD/ws/checkout'>
Making all in solver
make[2]: Entering directory
`<http://river.suse.de/job/libzypp-testsuite-HEAD/ws/checkout/solver'>
Making all in src
make[3]: Entering directory
`<http://river.suse.de/job/libzypp-testsuite-HEAD/ws/checkout/solver/src'>
make[3]: Nothing to be done for `all'.
make[3]: Leaving directory
`<http://river.suse.de/job/libzypp-testsuite-HEAD/ws/checkout/solver/src'>
Making all in single.out
make[3]: Entering directory
`<http://river.suse.de/job/libzypp-testsuite-HEAD/ws/checkout/solver/single.out'>
make[3]: Nothing to be done for `all'.
make[3]: Leaving directory
`<http://river.suse.de/job/libzypp-testsuite-HEAD/ws/checkout/solver/single.out'>
Making all in config
make[3]: Entering directory
`<http://river.suse.de/job/libzypp-testsuite-HEAD/ws/checkout/solver/config'>
make[3]: Nothing to be done for `all'.
make[3]: Leaving directory
`<http://river.suse.de/job/libzypp-testsuite-HEAD/ws/checkout/solver/config'>
Making all in lib
make[3]: Entering directory
`<http://river.suse.de/job/libzypp-testsuite-HEAD/ws/checkout/solver/lib'>
make[3]: Nothing to be done for `all'.
make[3]: Leaving directory
`<http://river.suse.de/job/libzypp-testsuite-HEAD/ws/checkout/solver/lib'>
Making all in solver.test
make[3]: Entering directory
`<http://river.suse.de/job/libzypp-testsuite-HEAD/ws/checkout/solver/solver.test'>
make[3]: Nothing to be done for `all'.
make[3]: Leaving directory
`<http://river.suse.de/job/libzypp-testsuite-HEAD/ws/checkout/solver/solver.test'>
make[3]: Entering directory
`<http://river.suse.de/job/libzypp-testsuite-HEAD/ws/checkout/solver'>
make[3]: Nothing to be done for `all-am'.
make[3]: Leaving directory
`<http://river.suse.de/job/libzypp-testsuite-HEAD/ws/checkout/solver'>
make[2]: Leaving directory
`<http://river.suse.de/job/libzypp-testsuite-HEAD/ws/checkout/solver'>
make[2]: Entering directory
`<http://river.suse.de/job/libzypp-testsuite-HEAD/ws/checkout'>
make[2]: Leaving directory
`<http://river.suse.de/job/libzypp-testsuite-HEAD/ws/checkout'>
make[1]: Leaving directory
`<http://river.suse.de/job/libzypp-testsuite-HEAD/ws/checkout'>
+ make install
Making install in solver
make[1]: Entering directory
`<http://river.suse.de/job/libzypp-testsuite-HEAD/ws/checkout/solver'>
Making install in src
make[2]: Entering directory
`<http://river.suse.de/job/libzypp-testsuite-HEAD/ws/checkout/solver/src'>
make[3]: Entering directory
`<http://river.suse.de/job/libzypp-testsuite-HEAD/ws/checkout/solver/src'>
make[3]: Nothing to be done for `install-exec-am'.
test -z "/usr/lib/zypp/testsuite/bin" || /bin/mkdir -p
"/usr/lib/zypp/testsuite/bin"
/usr/bin/install -c -m 644 deptestomatic.multi '/usr/lib/zypp/testsuite/bin'
make[3]: Leaving directory
`<http://river.suse.de/job/libzypp-testsuite-HEAD/ws/checkout/solver/src'>
make[2]: Leaving directory
`<http://river.suse.de/job/libzypp-testsuite-HEAD/ws/checkout/solver/src'>
Making install in single.out
make[2]: Entering directory
`<http://river.suse.de/job/libzypp-testsuite-HEAD/ws/checkout/solver/single.out'>
make[3]: Entering directory
`<http://river.suse.de/job/libzypp-testsuite-HEAD/ws/checkout/solver/single.out'>
make[3]: Nothing to be done for `install-exec-am'.
test -z "/usr/share/zypp/testsuite/data/solver/single.out" || /bin/mkdir -p
"/usr/share/zypp/testsuite/data/solver/single.out"
/usr/bin/install -c -m 644 edition.out spec.out utils.out edition.err spec.err
utils.err '/usr/share/zypp/testsuite/data/solver/single.out'
make[3]: Leaving directory
`<http://river.suse.de/job/libzypp-testsuite-HEAD/ws/checkout/solver/single.out'>
make[2]: Leaving directory
`<http://river.suse.de/job/libzypp-testsuite-HEAD/ws/checkout/solver/single.out'>
Making install in config
make[2]: Entering directory
`<http://river.suse.de/job/libzypp-testsuite-HEAD/ws/checkout/solver/config'>
make[3]: Entering directory
`<http://river.suse.de/job/libzypp-testsuite-HEAD/ws/checkout/solver/config'>
make[3]: Nothing to be done for `install-exec-am'.
test -z "/usr/share/zypp/testsuite/data/solver/config" || /bin/mkdir -p
"/usr/share/zypp/testsuite/data/solver/config"
/usr/bin/install -c -m 644 default.exp unix.exp unknown.exp
'/usr/share/zypp/testsuite/data/solver/config'
make[3]: Leaving directory
`<http://river.suse.de/job/libzypp-testsuite-HEAD/ws/checkout/solver/config'>
make[2]: Leaving directory
`<http://river.suse.de/job/libzypp-testsuite-HEAD/ws/checkout/solver/config'>
Making install in lib
make[2]: Entering directory
`<http://river.suse.de/job/libzypp-testsuite-HEAD/ws/checkout/solver/lib'>
make[3]: Entering directory
`<http://river.suse.de/job/libzypp-testsuite-HEAD/ws/checkout/solver/lib'>
make[3]: Nothing to be done for `install-exec-am'.
test -z "/usr/share/zypp/testsuite/data/solver/lib" || /bin/mkdir -p
"/usr/share/zypp/testsuite/data/solver/lib"
/usr/bin/install -c -m 644 solver_init.exp
'/usr/share/zypp/testsuite/data/solver/lib'
make[3]: Leaving directory
`<http://river.suse.de/job/libzypp-testsuite-HEAD/ws/checkout/solver/lib'>
make[2]: Leaving directory
`<http://river.suse.de/job/libzypp-testsuite-HEAD/ws/checkout/solver/lib'>
Making install in solver.test
make[2]: Entering directory
`<http://river.suse.de/job/libzypp-testsuite-HEAD/ws/checkout/solver/solver.test'>
make[3]: Entering directory
`<http://river.suse.de/job/libzypp-testsuite-HEAD/ws/checkout/solver/solver.test'>
make[3]: Nothing to be done for `install-exec-am'.
test -z "/usr/share/zypp/testsuite/data/solver/solver.test" || /bin/mkdir -p
"/usr/share/zypp/testsuite/data/solver/solver.test"
/usr/bin/install -c -m 644 multi_test.exp parser_test.exp single_test.exp
'/usr/share/zypp/testsuite/data/solver/solver.test'
make[3]: Leaving directory
`<http://river.suse.de/job/libzypp-testsuite-HEAD/ws/checkout/solver/solver.test'>
make[2]: Leaving directory
`<http://river.suse.de/job/libzypp-testsuite-HEAD/ws/checkout/solver/solver.test'>
make[2]: Entering directory
`<http://river.suse.de/job/libzypp-testsuite-HEAD/ws/checkout/solver'>
make[3]: Entering directory
`<http://river.suse.de/job/libzypp-testsuite-HEAD/ws/checkout/solver'>
make[3]: Nothing to be done for `install-exec-am'.
make install-data-hook
make[4]: Entering directory
`<http://river.suse.de/job/libzypp-testsuite-HEAD/ws/checkout/solver'>
/usr/bin/install -c -d /usr/share/zypp/testsuite/data; \
/usr/bin/install -c -d /usr/share/zypp/testsuite/data/solver; \
/usr/bin/install -c -d
/usr/share/zypp/testsuite/data/solver/data.deptestomatic; \
for f in `(cd ./data.deptestomatic; find -type d)`; do \
/usr/bin/install -c -d
/usr/share/zypp/testsuite/data/solver/data.deptestomatic/$f;
\
done; \
for f in `(cd ./data.deptestomatic; find -type f)`; do \
/usr/bin/install -c -m 644 ./data.deptestomatic/$f
/usr/share/zypp/testsuite/data/solver/data.deptestomatic/$f; \
done;
/bin/sh: line 8: cd: ./data.deptestomatic: No such file or directory
/bin/sh: line 8: cd: ./data.deptestomatic: No such file or directory
/usr/bin/install: cannot stat `./data.deptestomatic/./single.out/spec.out': No
such file or directory
/usr/bin/install: cannot stat `./data.deptestomatic/./single.out/Makefile': No
such file or directory
/usr/bin/install: cannot stat `./data.deptestomatic/./single.out/spec.err': No
such file or directory
/usr/bin/install: cannot stat `./data.deptestomatic/./single.out/utils.err': No
such file or directory
/usr/bin/install: cannot stat `./data.deptestomatic/./single.out/edition.out':
No such file or directory
/usr/bin/install: cannot stat `./data.deptestomatic/./single.out/edition.err':
No such file or directory
/usr/bin/install: cannot stat `./data.deptestomatic/./single.out/Makefile.am':
No such file or directory
/usr/bin/install: cannot stat `./data.deptestomatic/./single.out/Makefile.in':
No such file or directory
/usr/bin/install: cannot stat `./data.deptestomatic/./single.out/utils.out': No
such file or directory
/usr/bin/install: cannot stat `./data.deptestomatic/./Makefile': No such file
or directory
/usr/bin/install: cannot stat `./data.deptestomatic/./lib/Makefile': No such
file or directory
/usr/bin/install: cannot stat `./data.deptestomatic/./lib/solver_init.exp': No
such file or directory
/usr/bin/install: cannot stat `./data.deptestomatic/./lib/Makefile.am': No such
file or directory
/usr/bin/install: cannot stat `./data.deptestomatic/./lib/Makefile.in': No such
file or directory
/usr/bin/install: cannot stat `./data.deptestomatic/./config/default.exp': No
such file or directory
/usr/bin/install: cannot stat `./data.deptestomatic/./config/Makefile': No such
file or directory
/usr/bin/install: cannot stat `./data.deptestomatic/./config/unix.exp': No such
file or directory
/usr/bin/install: cannot stat `./data.deptestomatic/./config/unknown.exp': No
such file or directory
/usr/bin/install: cannot stat `./data.deptestomatic/./config/Makefile.am': No
such file or directory
/usr/bin/install: cannot stat `./data.deptestomatic/./config/Makefile.in': No
such file or directory
/usr/bin/install: cannot stat `./data.deptestomatic/./src/XmlNode.cc': No such
file or directory
/usr/bin/install: cannot stat
`./data.deptestomatic/./src/deptestomatic_noui-XmlNode.o': No such file or
directory
/usr/bin/install: cannot stat `./data.deptestomatic/./src/Makefile': No such
file or directory
/usr/bin/install: cannot stat `./data.deptestomatic/./src/deptestomatic.multi':
No such file or directory
/usr/bin/install: cannot stat `./data.deptestomatic/./src/XmlNode.o': No such
file or directory
/usr/bin/install: cannot stat `./data.deptestomatic/./src/XmlNode.h': No such
file or directory
/usr/bin/install: cannot stat `./data.deptestomatic/./src/Makefile.am': No such
file or directory
/usr/bin/install: cannot stat `./data.deptestomatic/./src/deptestomatic.o': No
such file or directory
/usr/bin/install: cannot stat `./data.deptestomatic/./src/Makefile.in': No such
file or directory
/usr/bin/install: cannot stat `./data.deptestomatic/./src/KeyRingCallbacks.h':
No such file or directory
/usr/bin/install: cannot stat `./data.deptestomatic/./src/deptestomatic.cc': No
such file or directory
/usr/bin/install: cannot stat `./data.deptestomatic/./src/deptestomatic.noui':
No such file or directory
/usr/bin/install: cannot stat `./data.deptestomatic/./src/.deps/XmlNode.Po': No
such file or directory
/usr/bin/install: cannot stat
`./data.deptestomatic/./src/.deps/deptestomatic_noui-deptestomatic.Po': No such
file or directory
/usr/bin/install: cannot stat
`./data.deptestomatic/./src/.deps/deptestomatic_noui-XmlNode.Po': No such file
or directory
/usr/bin/install: cannot stat
`./data.deptestomatic/./src/.deps/deptestomatic.Po': No such file or directory
/usr/bin/install: cannot stat
`./data.deptestomatic/./src/deptestomatic_noui-deptestomatic.o': No such file
or directory
/usr/bin/install: cannot stat `./data.deptestomatic/./Makefile.am': No such
file or directory
/usr/bin/install: cannot stat
`./data.deptestomatic/./solver.test/single_test.exp': No such file or directory
/usr/bin/install: cannot stat `./data.deptestomatic/./solver.test/Makefile': No
such file or directory
/usr/bin/install: cannot stat
`./data.deptestomatic/./solver.test/parser_test.exp': No such file or directory
/usr/bin/install: cannot stat `./data.deptestomatic/./solver.test/Makefile.am':
No such file or directory
/usr/bin/install: cannot stat `./data.deptestomatic/./solver.test/Makefile.in':
No such file or directory
/usr/bin/install: cannot stat
`./data.deptestomatic/./solver.test/multi_test.exp': No such file or directory
/usr/bin/install: cannot stat `./data.deptestomatic/./Makefile.in': No such
file or directory
/usr/bin/install: cannot stat `./data.deptestomatic/./deptestomatic.howto': No
such file or directory
make[4]: *** [install-data-hook] Error 1
make[4]: Leaving directory
`<http://river.suse.de/job/libzypp-testsuite-HEAD/ws/checkout/solver'>
make[3]: *** [install-data-am] Error 2
make[3]: Leaving directory
`<http://river.suse.de/job/libzypp-testsuite-HEAD/ws/checkout/solver'>
make[2]: *** [install-am] Error 2
make[2]: Leaving directory
`<http://river.suse.de/job/libzypp-testsuite-HEAD/ws/checkout/solver'>
make[1]: *** [install-recursive] Error 1
make[1]: Leaving directory
`<http://river.suse.de/job/libzypp-testsuite-HEAD/ws/checkout/solver'>
make: *** [install-recursive] Error 1
Build step 'Execute shell' marked build as failure
Archiving artifacts

--
To unsubscribe, e-mail: zypp-commit+unsubscribe@xxxxxxxxxxxx
For additional commands, e-mail: zypp-commit+help@xxxxxxxxxxxx

< Previous Next >
List Navigation
Follow Ups
References