Mailinglist Archive: zypp-commit (61 mails)

< Previous Next >
[zypp-commit] Build failed in Hudson: libzypp-head-x86_64 #903
See <http://yast.suse.de:3334/job/libzypp-head-x86_64/903/>

------------------------------------------
[...truncated 4789 lines...]
Linking CXX executable inidict_test
make[2]: Leaving directory `/tmp/rpmbuild/libzypp-6.31.3/build'
[ 95%] Built target inidict_test
make[2]: Entering directory `/tmp/rpmbuild/libzypp-6.31.3/build'
Scanning dependencies of target iniparser_test
make[2]: Leaving directory `/tmp/rpmbuild/libzypp-6.31.3/build'
make[2]: Entering directory `/tmp/rpmbuild/libzypp-6.31.3/build'
[ 95%] Building CXX object
tests/parser/inifile/CMakeFiles/iniparser_test.dir/iniparser_test.cc.o
Linking CXX executable iniparser_test
make[2]: Leaving directory `/tmp/rpmbuild/libzypp-6.31.3/build'
[ 95%] Built target iniparser_test
make[2]: Entering directory `/tmp/rpmbuild/libzypp-6.31.3/build'
Scanning dependencies of target WebpinResultFileReader_test
make[2]: Leaving directory `/tmp/rpmbuild/libzypp-6.31.3/build'
make[2]: Entering directory `/tmp/rpmbuild/libzypp-6.31.3/build'
[ 95%] Building CXX object
tests/parser/ws/CMakeFiles/WebpinResultFileReader_test.dir/WebpinResultFileReader_test.cc.o
Linking CXX executable WebpinResultFileReader_test
make[2]: Leaving directory `/tmp/rpmbuild/libzypp-6.31.3/build'
[ 95%] Built target WebpinResultFileReader_test
make[2]: Entering directory `/tmp/rpmbuild/libzypp-6.31.3/build'
Scanning dependencies of target ExtendedMetadata_test
make[2]: Leaving directory `/tmp/rpmbuild/libzypp-6.31.3/build'
make[2]: Entering directory `/tmp/rpmbuild/libzypp-6.31.3/build'
[ 97%] Building CXX object
tests/repo/CMakeFiles/ExtendedMetadata_test.dir/ExtendedMetadata_test.cc.o
Linking CXX executable ExtendedMetadata_test
make[2]: Leaving directory `/tmp/rpmbuild/libzypp-6.31.3/build'
[ 97%] Built target ExtendedMetadata_test
make[2]: Entering directory `/tmp/rpmbuild/libzypp-6.31.3/build'
Scanning dependencies of target RepoVariables_test
make[2]: Leaving directory `/tmp/rpmbuild/libzypp-6.31.3/build'
make[2]: Entering directory `/tmp/rpmbuild/libzypp-6.31.3/build'
[ 98%] Building CXX object
tests/repo/CMakeFiles/RepoVariables_test.dir/RepoVariables_test.cc.o
Linking CXX executable RepoVariables_test
make[2]: Leaving directory `/tmp/rpmbuild/libzypp-6.31.3/build'
[ 98%] Built target RepoVariables_test
make[2]: Entering directory `/tmp/rpmbuild/libzypp-6.31.3/build'
Scanning dependencies of target YUMDownloader_test
make[2]: Leaving directory `/tmp/rpmbuild/libzypp-6.31.3/build'
make[2]: Entering directory `/tmp/rpmbuild/libzypp-6.31.3/build'
[ 98%] Building CXX object
tests/repo/yum/CMakeFiles/YUMDownloader_test.dir/YUMDownloader_test.cc.o
Linking CXX executable YUMDownloader_test
make[2]: Leaving directory `/tmp/rpmbuild/libzypp-6.31.3/build'
[ 98%] Built target YUMDownloader_test
make[2]: Entering directory `/tmp/rpmbuild/libzypp-6.31.3/build'
Scanning dependencies of target Downloader_test
make[2]: Leaving directory `/tmp/rpmbuild/libzypp-6.31.3/build'
make[2]: Entering directory `/tmp/rpmbuild/libzypp-6.31.3/build'
[ 98%] Building CXX object
tests/repo/susetags/CMakeFiles/Downloader_test.dir/Downloader_test.cc.o
Linking CXX executable Downloader_test
make[2]: Leaving directory `/tmp/rpmbuild/libzypp-6.31.3/build'
[ 98%] Built target Downloader_test
make[2]: Entering directory `/tmp/rpmbuild/libzypp-6.31.3/build'
Scanning dependencies of target AttrMatcher_test
make[2]: Leaving directory `/tmp/rpmbuild/libzypp-6.31.3/build'
make[2]: Entering directory `/tmp/rpmbuild/libzypp-6.31.3/build'
[ 98%] Building CXX object
tests/sat/CMakeFiles/AttrMatcher_test.dir/AttrMatcher_test.cc.o
Linking CXX executable AttrMatcher_test
make[2]: Leaving directory `/tmp/rpmbuild/libzypp-6.31.3/build'
[ 98%] Built target AttrMatcher_test
make[2]: Entering directory `/tmp/rpmbuild/libzypp-6.31.3/build'
Scanning dependencies of target LookupAttr_test
make[2]: Leaving directory `/tmp/rpmbuild/libzypp-6.31.3/build'
make[2]: Entering directory `/tmp/rpmbuild/libzypp-6.31.3/build'
[ 98%] Building CXX object
tests/sat/CMakeFiles/LookupAttr_test.dir/LookupAttr_test.cc.o
Linking CXX executable LookupAttr_test
make[2]: Leaving directory `/tmp/rpmbuild/libzypp-6.31.3/build'
[ 98%] Built target LookupAttr_test
make[2]: Entering directory `/tmp/rpmbuild/libzypp-6.31.3/build'
Scanning dependencies of target SolvParsing_test
make[2]: Leaving directory `/tmp/rpmbuild/libzypp-6.31.3/build'
make[2]: Entering directory `/tmp/rpmbuild/libzypp-6.31.3/build'
[ 98%] Building CXX object
tests/sat/CMakeFiles/SolvParsing_test.dir/SolvParsing_test.cc.o
Linking CXX executable SolvParsing_test
make[2]: Leaving directory `/tmp/rpmbuild/libzypp-6.31.3/build'
[ 98%] Built target SolvParsing_test
make[2]: Entering directory `/tmp/rpmbuild/libzypp-6.31.3/build'
Scanning dependencies of target Solvable_test
make[2]: Leaving directory `/tmp/rpmbuild/libzypp-6.31.3/build'
make[2]: Entering directory `/tmp/rpmbuild/libzypp-6.31.3/build'
[ 98%] Building CXX object
tests/sat/CMakeFiles/Solvable_test.dir/Solvable_test.cc.o
Linking CXX executable Solvable_test
make[2]: Leaving directory `/tmp/rpmbuild/libzypp-6.31.3/build'
[ 98%] Built target Solvable_test
make[2]: Entering directory `/tmp/rpmbuild/libzypp-6.31.3/build'
Scanning dependencies of target WhatObsoletes_test
make[2]: Leaving directory `/tmp/rpmbuild/libzypp-6.31.3/build'
make[2]: Entering directory `/tmp/rpmbuild/libzypp-6.31.3/build'
[ 98%] Building CXX object
tests/sat/CMakeFiles/WhatObsoletes_test.dir/WhatObsoletes_test.cc.o
Linking CXX executable WhatObsoletes_test
make[2]: Leaving directory `/tmp/rpmbuild/libzypp-6.31.3/build'
[ 98%] Built target WhatObsoletes_test
make[2]: Entering directory `/tmp/rpmbuild/libzypp-6.31.3/build'
Scanning dependencies of target WhatProvides_test
make[2]: Leaving directory `/tmp/rpmbuild/libzypp-6.31.3/build'
make[2]: Entering directory `/tmp/rpmbuild/libzypp-6.31.3/build'
[100%] Building CXX object
tests/sat/CMakeFiles/WhatProvides_test.dir/WhatProvides_test.cc.o
Linking CXX executable WhatProvides_test
make[2]: Leaving directory `/tmp/rpmbuild/libzypp-6.31.3/build'
[100%] Built target WhatProvides_test
make[1]: Leaving directory `/tmp/rpmbuild/libzypp-6.31.3/build'
make: Leaving directory `/tmp/rpmbuild/libzypp-6.31.3/build/tests'
+ pushd tests
/tmp/rpmbuild/libzypp-6.31.3/build/tests /tmp/rpmbuild/libzypp-6.31.3/build
+ LD_LIBRARY_PATH=/tmp/rpmbuild/libzypp-6.31.3/build/tests/../zypp:
+ ctest .
Test project /tmp/rpmbuild/libzypp-6.31.3/build/tests
Start 1: CredentialManager_test
1/52 Test #1: CredentialManager_test ........... Passed 0.05 sec
Start 2: CredentialFileReader_test
2/52 Test #2: CredentialFileReader_test ........ Passed 0.02 sec
Start 3: Arch_test
3/52 Test #3: Arch_test ........................ Passed 0.01 sec
Start 4: Capabilities_test
4/52 Test #4: Capabilities_test ................***Exception: SegFault 0.09
sec
Start 5: CheckSum_test
5/52 Test #5: CheckSum_test .................... Passed 0.02 sec
Start 6: Date_test
6/52 Test #6: Date_test ........................ Passed 0.03 sec
Start 7: Dup_test
7/52 Test #7: Dup_test ......................... Passed 0.03 sec
Start 8: Digest_test
8/52 Test #8: Digest_test ...................... Passed 0.02 sec
Start 9: Deltarpm_test
9/52 Test #9: Deltarpm_test .................... Passed 0.27 sec
Start 10: Edition_test
10/52 Test #10: Edition_test ..................... Passed 0.03 sec
Start 11: Fetcher_test
11/52 Test #11: Fetcher_test ..................... Passed 4.94 sec
Start 12: FileChecker_test
12/52 Test #12: FileChecker_test ................. Passed 0.56 sec
Start 13: InstanceId_test
13/52 Test #13: InstanceId_test ..................***Exception: SegFault 0.16
sec
Start 14: KeyRing_test
14/52 Test #14: KeyRing_test ..................... Passed 0.83 sec
Start 15: Locks_test
15/52 Test #15: Locks_test .......................***Exception: SegFault 0.05
sec
Start 16: MediaSetAccess_test
16/52 Test #16: MediaSetAccess_test .............. Passed 1.15 sec
Start 17: PathInfo_test
17/52 Test #17: PathInfo_test .................... Passed 0.04 sec
Start 18: PoolQuery_test
18/52 Test #18: PoolQuery_test ...................***Exception: SegFault 0.22
sec
Start 19: ProgressData_test
19/52 Test #19: ProgressData_test ................ Passed 0.03 sec
Start 20: PublicKey_test
20/52 Test #20: PublicKey_test ................... Passed 0.03 sec
Start 21: RWPtr_test
21/52 Test #21: RWPtr_test ....................... Passed 0.01 sec
Start 22: RepoInfo_test
22/52 Test #22: RepoInfo_test .................... Passed 0.01 sec
Start 23: RepoManager_test
23/52 Test #23: RepoManager_test .................***Exception: SegFault 0.39
sec
Start 24: RepoStatus_test
24/52 Test #24: RepoStatus_test .................. Passed 0.02 sec
Start 25: ResKind_test
25/52 Test #25: ResKind_test ..................... Passed 0.02 sec
Start 26: ResStatus_test
26/52 Test #26: ResStatus_test ................... Passed 0.02 sec
Start 27: Selectable_test
27/52 Test #27: Selectable_test .................. Passed 0.06 sec
Start 28: Target_test
28/52 Test #28: Target_test ...................... Passed 0.67 sec
Start 29: Url_test
29/52 Test #29: Url_test ......................... Passed 0.05 sec
Start 30: Vendor_test
30/52 Test #30: Vendor_test ...................... Passed 0.04 sec
Start 31: Vendor2_test
31/52 Test #31: Vendor2_test ..................... Passed 0.04 sec
Start 32: Glob_test
32/52 Test #32: Glob_test ........................ Passed 0.03 sec
Start 33: Sysconfig_test
33/52 Test #33: Sysconfig_test ................... Passed 0.03 sec
Start 34: String_test
34/52 Test #34: String_test ...................... Passed 0.02 sec
Start 35: InterProcessMutex_test
35/52 Test #35: InterProcessMutex_test ........... Passed 6.04 sec
Start 36: InterProcessMutex2_test
36/52 Test #36: InterProcessMutex2_test .......... Passed 6.04 sec
Start 37: ProductFileReader_test
37/52 Test #37: ProductFileReader_test ........... Passed 0.03 sec
Start 38: RepomdFileReader_test
38/52 Test #38: RepomdFileReader_test ............ Passed 0.03 sec
Start 39: PatchesFileReader_test
39/52 Test #39: PatchesFileReader_test ........... Passed 0.04 sec
Start 40: inidict_test
40/52 Test #40: inidict_test ..................... Passed 0.02 sec
Start 41: iniparser_test
41/52 Test #41: iniparser_test ................... Passed 0.03 sec
Start 42: WebpinResultFileReader_test
42/52 Test #42: WebpinResultFileReader_test ...... Passed 0.05 sec
Start 43: RepoVariables_test
43/52 Test #43: RepoVariables_test ............... Passed 0.46 sec
Start 44: ExtendedMetadata_test
44/52 Test #44: ExtendedMetadata_test ............ Passed 0.15 sec
Start 45: YUMDownloader_test
45/52 Test #45: YUMDownloader_test ............... Passed 0.15 sec
Start 46: Downloader_test
46/52 Test #46: Downloader_test ..................***Exception: SegFault 0.16
sec
Start 47: Solvable_test
47/52 Test #47: Solvable_test ....................***Exception: SegFault 0.05
sec
Start 48: SolvParsing_test
48/52 Test #48: SolvParsing_test ................. Passed 0.18 sec
Start 49: WhatProvides_test
49/52 Test #49: WhatProvides_test ................***Exception: SegFault 0.04
sec
Start 50: WhatObsoletes_test
50/52 Test #50: WhatObsoletes_test ............... Passed 0.02 sec
Start 51: LookupAttr_test
51/52 Test #51: LookupAttr_test ..................***Exception: SegFault 1.04
sec
Start 52: AttrMatcher_test
52/52 Test #52: AttrMatcher_test ................. Passed 0.04 sec

83% tests passed, 9 tests failed out of 52

Total Test time (real) = 24.60 sec

The following tests FAILED:
4 - Capabilities_test (SEGFAULT)
13 - InstanceId_test (SEGFAULT)
15 - Locks_test (SEGFAULT)
18 - PoolQuery_test (SEGFAULT)
23 - RepoManager_test (SEGFAULT)
46 - Downloader_test (SEGFAULT)
47 - Solvable_test (SEGFAULT)
49 - WhatProvides_test (SEGFAULT)
51 - LookupAttr_test (SEGFAULT)
Errors while running CTest
error: Bad exit status from /var/tmp/rpm-tmp.f7FxJE (%build)


RPM build errors:
Bad exit status from /var/tmp/rpm-tmp.f7FxJE (%build)

( )
( ) (
) _ )
( \_
_(_\ \)__
(____\___))

build failed

stopping dbus..
Shutting down D-Bus daemon..done
... unmounting sys
... unmounting proc
... unmounting pts
[locks-and-latches] Releasing all the locks
[locks-and-latches] All the locks released
Archiving artifacts

--
To unsubscribe, e-mail: zypp-commit+unsubscribe@xxxxxxxxxxxx
For additional commands, e-mail: zypp-commit+help@xxxxxxxxxxxx

< Previous Next >