Mailinglist Archive: zypp-commit (166 mails)

< Previous Next >
[zypp-commit] Build failed in Hudson: libzypp-bindings-head-x86_64 #726
See <http://yast.suse.de:3334/job/libzypp-bindings-head-x86_64/726/>

------------------------------------------
[...truncated 199 lines...]
/usr/include/zypp/PublicKey.h:39: Warning(401): Nothing known about base class
'Exception'. Ignored.
/usr/include/zypp/KeyRing.h:45: Warning(401): Nothing known about base class
'callback::ReportBase'. Ignored.
/usr/include/zypp/KeyRing.h:99: Warning(401): Nothing known about base class
'callback::ReportBase'. Ignored.
/usr/include/zypp/KeyRing.h:107: Warning(401): Nothing known about base class
'Exception'. Ignored.
/usr/include/zypp/Target.h:50: Warning(401): Nothing known about base class
'base::NonCopyable'. Ignored.
/usr/include/zypp/ZYppFactory.h:25: Warning(401): Nothing known about base
class 'Exception'. Ignored.
/usr/include/zypp/PoolItem.h:107: Warning(508): Declaration of 'satSolvable'
shadows declaration accessible via operator->(),
/usr/include/zypp/Resolvable.h:138: Warning(508): previous declaration of
'satSolvable'.
/usr/include/boost/smart_ptr/intrusive_ptr.hpp:133: Warning(508): Declaration
of 'reset' shadows declaration accessible via operator->(),
/usr/include/zypp/Resolver.h:108: Warning(508): previous declaration of 'reset'.
/usr/include/zypp/IdString.h:223: Warning(503): Can't wrap '::zypp::IdString'
unless renamed to a valid identifier.
/usr/include/zypp/ByteCount.h:32: Warning(503): Can't wrap 'operator <<' unless
renamed to a valid identifier.
/usr/include/zypp/ByteCount.h:86: Warning(503): Can't wrap 'operator size_type'
unless renamed to a valid identifier.
/usr/include/zypp/Date.h:33: Warning(503): Can't wrap 'operator <<' unless
renamed to a valid identifier.
/usr/include/zypp/Date.h:65: Warning(503): Can't wrap 'operator value_type'
unless renamed to a valid identifier.
/usr/include/zypp/Dep.h:31: Warning(503): Can't wrap 'operator ==' unless
renamed to a valid identifier.
/usr/include/zypp/Dep.h:34: Warning(503): Can't wrap 'operator <' unless
renamed to a valid identifier.
/usr/include/zypp/Capability.h:380: Warning(503): Can't wrap
'::zypp::Capability' unless renamed to a valid identifier.
/usr/include/zypp/Capabilities.h:98: Warning(503): Can't wrap class
Zypp::Capabilities::constIterator unless renamed to a valid identifier.
/usr/include/zypp/CapMatch.h:56: Warning(503): Can't wrap 'operator ==' unless
renamed to a valid identifier.
/usr/include/zypp/CapMatch.h:88: Warning(503): Can't wrap 'operator <<' unless
renamed to a valid identifier.
/usr/include/zypp/repo/RepoInfoBase.h:38: Warning(503): Can't wrap 'operator
<<' unless renamed to a valid identifier.
/usr/include/zypp/RepoInfo.h:68: Warning(503): Can't wrap 'operator <<' unless
renamed to a valid identifier.
/usr/include/zypp/ResStatus.h:55: Warning(503): Can't wrap 'operator <<' unless
renamed to a valid identifier.
/usr/include/zypp/ResStatus.h:56: Warning(503): Can't wrap 'operator ==' unless
renamed to a valid identifier.
/usr/include/zypp/Resolvable.h:42: Warning(503): Can't wrap 'operator <<'
unless renamed to a valid identifier.
/usr/include/zypp/ResObject.h:196: Warning(503): Can't wrap
'zypp::make_res_object' unless renamed to a valid identifier.
/usr/include/zypp/Package.h:122: Warning(503): Can't wrap 'zypp::make<(self)>'
unless renamed to a valid identifier.
/usr/include/zypp/Patch.h:157: Warning(503): Can't wrap class
Zypp::Patch::ReferenceIterator unless renamed to a valid identifier.
/usr/include/zypp/Product.h:171: Warning(503): Can't wrap class
Zypp::Product::UrlList unless renamed to a valid identifier.
/usr/include/zypp/Repository.h:328: Warning(503): Can't wrap class
Zypp::Repository::ProductInfoIterator unless renamed to a valid identifier.
/usr/include/zypp/Repository.h:388: Warning(503): Can't wrap class
Zypp::Repository::EraseFromPool unless renamed to a valid identifier.
/usr/include/zypp/RepoStatus.h:39: Warning(503): Can't wrap 'operator <<'
unless renamed to a valid identifier.
/usr/include/zypp/RepoManager.h:109: Warning(503): Can't wrap 'operator <<'
unless renamed to a valid identifier.
/usr/include/zypp/PublicKey.h:78: Warning(503): Can't wrap 'operator <<' unless
renamed to a valid identifier.
/usr/include/zypp/KeyRing.h:134: Warning(503): Can't wrap 'operator <<' unless
renamed to a valid identifier.
/usr/include/zypp/Target.h:188: Warning(503): Can't wrap 'operator <<' unless
renamed to a valid identifier.
/usr/include/zypp/MediaSetAccess.h:79: Warning(503): Can't wrap 'operator <<'
unless renamed to a valid identifier.
/usr/include/zypp/PoolItem.h:52: Warning(503): Can't wrap 'operator <<' unless
renamed to a valid identifier.
/usr/include/zypp/PoolItem.h:124: Warning(503): Can't wrap 'operator
res_object::const_ptr' unless renamed to a valid identifier.
/usr/include/zypp/PoolItem.h:133: Warning(503): Can't wrap 'operator
res_object::const_ptr::unspecified_bool_type' unless renamed to a valid
identifier.
/usr/include/zypp/ResPool.h:49: Warning(503): Can't wrap 'operator <<' unless
renamed to a valid identifier.
/usr/include/zypp/TmpPath.h:62: Warning(503): Can't wrap 'operator const void*'
unless renamed to a valid identifier.
/usr/include/zypp/TmpPath.h:74: Warning(503): Can't wrap 'operator pathname'
unless renamed to a valid identifier.
/usr/include/zypp/ZYppFactory.h:41: Warning(503): Can't wrap 'operator <<'
unless renamed to a valid identifier.
cd /tmp/rpmbuild/libzypp-bindings-0.5.3/build/swig/ruby && /usr/bin/cmake -E
echo Done.
Done.
cd /tmp/rpmbuild/libzypp-bindings-0.5.3/build && /usr/bin/cmake -E
cmake_depends "Unix Makefiles" /tmp/rpmbuild/libzypp-bindings-0.5.3
/tmp/rpmbuild/libzypp-bindings-0.5.3/swig/ruby
/tmp/rpmbuild/libzypp-bindings-0.5.3/build
/tmp/rpmbuild/libzypp-bindings-0.5.3/build/swig/ruby
/tmp/rpmbuild/libzypp-bindings-0.5.3/build/swig/ruby/CMakeFiles/zypp_ruby.dir/DependInfo.cmake
--color=
Scanning dependencies of target zypp_ruby
make[2]: Leaving directory `/tmp/rpmbuild/libzypp-bindings-0.5.3/build'
make -f swig/ruby/CMakeFiles/zypp_ruby.dir/build.make
swig/ruby/CMakeFiles/zypp_ruby.dir/build
make[2]: Entering directory `/tmp/rpmbuild/libzypp-bindings-0.5.3/build'
/usr/bin/cmake -E cmake_progress_report
/tmp/rpmbuild/libzypp-bindings-0.5.3/build/CMakeFiles 5
[ 33%] Building CXX object
swig/ruby/CMakeFiles/zypp_ruby.dir/satsolver_ruby.cc.o
cd /tmp/rpmbuild/libzypp-bindings-0.5.3/build/swig/ruby &&
/opt/icecream/bin/g++ -Dzypp_ruby_EXPORTS -fPIC -fno-strict-aliasing
-fmessage-length=0 -O2 -Wall -D_FORTIFY_SOURCE=2 -fstack-protector
-funwind-tables -fasynchronous-unwind-tables -fPIC
-I/tmp/rpmbuild/libzypp-bindings-0.5.3
-I/tmp/rpmbuild/libzypp-bindings-0.5.3/build -I/usr/lib64/ruby/1.8/x86_64-linux
-o CMakeFiles/zypp_ruby.dir/satsolver_ruby.cc.o -c
/tmp/rpmbuild/libzypp-bindings-0.5.3/build/swig/ruby/satsolver_ruby.cc
/tmp/rpmbuild/libzypp-bindings-0.5.3/build/swig/ruby/satsolver_ruby.cc: In
function 'VALUE _wrap_Product_constPtr_type(int, VALUE*, VALUE)':
/tmp/rpmbuild/libzypp-bindings-0.5.3/build/swig/ruby/satsolver_ruby.cc:61303:30:
warning: 'std::string zypp::Product::type() const' is deprecated (declared at
/usr/include/zypp/Product.h:97)
/tmp/rpmbuild/libzypp-bindings-0.5.3/build/swig/ruby/satsolver_ruby.cc: In
function 'VALUE _wrap_Product_Ptr_type(int, VALUE*, VALUE)':
/tmp/rpmbuild/libzypp-bindings-0.5.3/build/swig/ruby/satsolver_ruby.cc:64428:30:
warning: 'std::string zypp::Product::type() const' is deprecated (declared at
/usr/include/zypp/Product.h:97)
/tmp/rpmbuild/libzypp-bindings-0.5.3/build/swig/ruby/satsolver_ruby.cc: In
function 'VALUE _wrap_Product_type(int, VALUE*, VALUE)':
/tmp/rpmbuild/libzypp-bindings-0.5.3/build/swig/ruby/satsolver_ruby.cc:74845:52:
warning: 'std::string zypp::Product::type() const' is deprecated (declared at
/usr/include/zypp/Product.h:97)
Linking CXX shared library zypp.so
cd /tmp/rpmbuild/libzypp-bindings-0.5.3/build/swig/ruby && /usr/bin/cmake -E
cmake_link_script CMakeFiles/zypp_ruby.dir/link.txt --verbose=1
/opt/icecream/bin/g++ -fPIC -fPIC -fno-strict-aliasing -fmessage-length=0 -O2
-Wall -D_FORTIFY_SOURCE=2 -fstack-protector -funwind-tables
-fasynchronous-unwind-tables -shared -Wl,-soname,zypp.so -o zypp.so
CMakeFiles/zypp_ruby.dir/satsolver_ruby.cc.o -lruby -lzypp
make[2]: Leaving directory `/tmp/rpmbuild/libzypp-bindings-0.5.3/build'
/usr/bin/cmake -E cmake_progress_report
/tmp/rpmbuild/libzypp-bindings-0.5.3/build/CMakeFiles 5 6
[ 33%] Built target zypp_ruby
make -f swig/python/CMakeFiles/zypp_python.dir/build.make
swig/python/CMakeFiles/zypp_python.dir/depend
make[2]: Entering directory `/tmp/rpmbuild/libzypp-bindings-0.5.3/build'
/usr/bin/cmake -E cmake_progress_report
/tmp/rpmbuild/libzypp-bindings-0.5.3/build/CMakeFiles 4
[ 50%] Generating satsolver_python.cc
cd /tmp/rpmbuild/libzypp-bindings-0.5.3/build/swig/python && /usr/bin/cmake -E
echo_append Creating\ wrapper\ code\ for\ python...
Creating wrapper code for python...cd
/tmp/rpmbuild/libzypp-bindings-0.5.3/build/swig/python && /usr/bin/swig -v
-DZYPP_DEPRECATED -DBOOST_SMARTPTR_INCLUDE_DIR -c++ -python -o
/tmp/rpmbuild/libzypp-bindings-0.5.3/build/swig/python/satsolver_python.cc
-I/usr/include /tmp/rpmbuild/libzypp-bindings-0.5.3/swig/zypp.i
LangSubDir: python
Search paths:
./
/usr/include/
./swig_lib/python/
/usr/share/swig/1.3.40/python/
./swig_lib/
/usr/share/swig/1.3.40/
Preprocessing...
Starting language-specific parse...
/usr/include/boost/smart_ptr/shared_ptr.hpp:310: Warning(362): operator= ignored
/usr/include/boost/smart_ptr/shared_ptr.hpp:319: Warning(362): operator= ignored
/usr/include/boost/smart_ptr/shared_ptr.hpp:330: Warning(362): operator= ignored
/usr/include/boost/smart_ptr/shared_ptr.hpp:339: Warning(362): operator= ignored
/usr/include/boost/smart_ptr/weak_ptr.hpp:103: Warning(362): operator= ignored
/usr/include/boost/smart_ptr/weak_ptr.hpp:111: Warning(362): operator= ignored
/usr/include/boost/smart_ptr/intrusive_ptr.hpp:114: Warning(362): operator=
ignored
/usr/include/boost/smart_ptr/intrusive_ptr.hpp:122: Warning(362): operator=
ignored
/usr/include/boost/smart_ptr/intrusive_ptr.hpp:128: Warning(362): operator=
ignored
/usr/include/zypp/IdStringType.h:96: Warning(362): operator= ignored
/usr/include/zypp/Pathname.h:67: Warning(362): operator= ignored
/usr/include/zypp/ByteCount.h:97: Warning(383): operator++ ignored
/usr/include/zypp/ByteCount.h:98: Warning(384): operator-- ignored
/usr/include/zypp/ByteCount.h:100: Warning(383): operator++ ignored
/usr/include/zypp/ByteCount.h:101: Warning(384): operator-- ignored
/usr/include/zypp/Url.h:179: Warning(362): operator= ignored
/usr/include/zypp/Url.h:193: Warning(362): operator= ignored
/usr/include/zypp/Edition.h:164: Warning(312): Nested class not currently
supported (ignored)
/usr/include/zypp/Date.h:76: Warning(383): operator++ ignored
/usr/include/zypp/Date.h:77: Warning(384): operator-- ignored
/usr/include/zypp/Date.h:79: Warning(383): operator++ ignored
/usr/include/zypp/Date.h:80: Warning(384): operator-- ignored
/usr/include/zypp/Capability.h:202: Warning(312): Nested class not currently
supported (ignored)
/usr/include/zypp/CapMatch.h:66: Warning(361): operator! ignored
/usr/include/zypp/CapMatch.h:76: Warning(381): operator&& ignored
/usr/include/zypp/CapMatch.h:86: Warning(382): operator|| ignored
/usr/include/zypp/sat/Solvable.h:206: Warning(389): operator[] ignored
(consider using %extend)
/usr/include/zypp/sat/Solvable.h:277: Warning(312): Nested class not currently
supported (ignored).
/usr/include/zypp/Resolvable.h:100: Warning(389): operator[] ignored (consider
using %extend)
/usr/include/zypp/RepoStatus.h:137: Warning(381): operator&& ignored
/tmp/rpmbuild/libzypp-bindings-0.5.3/swig/KeyRing.i:13: Warning(302):
Identifier 'KeyRing_Ptr' redefined (ignored),
/usr/include/zypp/KeyRing.h:33: Warning(302): previous definition of
'KeyRing_Ptr'.
/tmp/rpmbuild/libzypp-bindings-0.5.3/swig/Target.i:5: Warning(302): Identifier
'Target_Ptr' redefined (ignored),
/usr/include/zypp/Target.h:41: Warning(302): previous definition of
'Target_Ptr'.
/tmp/rpmbuild/libzypp-bindings-0.5.3/swig/KeyRing.i:9: Warning(303): %extend
defined for an undeclared class zypp::KeyRing.
/usr/include/zypp/CheckSum.h:26: Warning(401): Nothing known about base class
'Exception'. Ignored.
/usr/include/zypp/Date.h:118: Warning(401): Nothing known about base class
'Exception'. Ignored.
/usr/include/zypp/Capabilities.h:98: Warning(401): Nothing known about base
class 'boost::iterator_adaptor< const_iterator,sat::detail::IdType const
*,Capability const,boost::forward_traversal_tag,Capability const >'. Ignored.
/usr/include/zypp/Capabilities.h:98: Warning(401): Maybe you forgot to
instantiate 'boost::iterator_adaptor< const_iterator,sat::detail::IdType const
*,Capability const,boost::forward_traversal_tag,Capability const >' using
%template.
/usr/include/zypp/sat/Solvable.h:336: Warning(401): Nothing known about base
class 'boost::iterator_adaptor< SolvableIterator,::_Solvable *,Solvable
const,boost::forward_traversal_tag,Solvable const >'. Ignored.
/usr/include/zypp/sat/Solvable.h:336: Warning(401): Maybe you forgot to
instantiate 'boost::iterator_adaptor< SolvableIterator,::_Solvable *,Solvable
const,boost::forward_traversal_tag,Solvable const >' using %template.
/usr/include/zypp/Patch.h:157: Warning(401): Nothing known about base class
'boost::iterator_adaptor<
Patch::ReferenceIterator,sat::LookupAttr::iterator,int,boost::forward_traversal_tag,int
'. Ignored.
/usr/include/zypp/Patch.h:157: Warning(401): Maybe you forgot to instantiate
'boost::iterator_adaptor<
Patch::ReferenceIterator,sat::LookupAttr::iterator,int,boost::forward_traversal_tag,int
' using %template.
/usr/include/zypp/Repository.h:328: Warning(401): Nothing known about base
class 'boost::iterator_adaptor<
Repository::ProductInfoIterator,sat::LookupAttr::iterator,int,boost::forward_traversal_tag,int
'. Ignored.
/usr/include/zypp/Repository.h:328: Warning(401): Maybe you forgot to
instantiate 'boost::iterator_adaptor<
Repository::ProductInfoIterator,sat::LookupAttr::iterator,int,boost::forward_traversal_tag,int
' using %template.
/usr/include/zypp/Repository.h:409: Warning(401): Nothing known about base
class 'boost::iterator_adaptor< RepositoryIterator,::_Repo
**,Repository,boost::forward_traversal_tag,Repository >'. Ignored.
/usr/include/zypp/Repository.h:409: Warning(401): Maybe you forgot to
instantiate 'boost::iterator_adaptor< RepositoryIterator,::_Repo
**,Repository,boost::forward_traversal_tag,Repository >' using %template.
/usr/include/zypp/PublicKey.h:39: Warning(401): Nothing known about base class
'Exception'. Ignored.
/usr/include/zypp/KeyRing.h:45: Warning(401): Nothing known about base class
'callback::ReportBase'. Ignored.
/usr/include/zypp/KeyRing.h:99: Warning(401): Nothing known about base class
'callback::ReportBase'. Ignored.
/usr/include/zypp/KeyRing.h:107: Warning(401): Nothing known about base class
'Exception'. Ignored.
/usr/include/zypp/Target.h:50: Warning(401): Nothing known about base class
'base::NonCopyable'. Ignored.
/usr/include/zypp/ZYppFactory.h:25: Warning(401): Nothing known about base
class 'Exception'. Ignored.
/usr/include/zypp/PoolItem.h:107: Warning(508): Declaration of 'satSolvable'
shadows declaration accessible via operator->(),
/usr/include/zypp/Resolvable.h:138: Warning(508): previous declaration of
'satSolvable'.
/usr/include/boost/smart_ptr/intrusive_ptr.hpp:133: Warning(508): Declaration
of 'reset' shadows declaration accessible via operator->(),
/usr/include/zypp/Resolver.h:108: Warning(508): previous declaration of 'reset'.
/usr/include/zypp/IdString.h:223: Warning(503): Can't wrap '::zypp::IdString'
unless renamed to a valid identifier.
/usr/include/zypp/ByteCount.h:32: Warning(503): Can't wrap 'operator <<' unless
renamed to a valid identifier.
/usr/include/zypp/ByteCount.h:86: Warning(503): Can't wrap 'operator SizeType'
unless renamed to a valid identifier.
/usr/include/zypp/Date.h:33: Warning(503): Can't wrap 'operator <<' unless
renamed to a valid identifier.
/usr/include/zypp/Date.h:65: Warning(503): Can't wrap 'operator ValueType'
unless renamed to a valid identifier.
/usr/include/zypp/Dep.h:31: Warning(503): Can't wrap 'operator ==' unless
renamed to a valid identifier.
/usr/include/zypp/Dep.h:32: Warning(503): Can't wrap 'operator !=' unless
renamed to a valid identifier.
/usr/include/zypp/Dep.h:34: Warning(503): Can't wrap 'operator <' unless
renamed to a valid identifier.
/usr/include/zypp/Capability.h:380: Warning(503): Can't wrap
'::zypp::Capability' unless renamed to a valid identifier.
/usr/include/zypp/Capabilities.h:98: Warning(503): Can't wrap class
zypp::Capabilities::const_iterator unless renamed to a valid identifier.
/usr/include/zypp/CapMatch.h:56: Warning(503): Can't wrap 'operator ==' unless
renamed to a valid identifier.
/usr/include/zypp/CapMatch.h:59: Warning(503): Can't wrap 'operator !=' unless
renamed to a valid identifier.
/usr/include/zypp/CapMatch.h:88: Warning(503): Can't wrap 'operator <<' unless
renamed to a valid identifier.
/usr/include/zypp/repo/RepoInfoBase.h:38: Warning(503): Can't wrap 'operator
<<' unless renamed to a valid identifier.
/usr/include/zypp/RepoInfo.h:68: Warning(503): Can't wrap 'operator <<' unless
renamed to a valid identifier.
/usr/include/zypp/ResStatus.h:55: Warning(503): Can't wrap 'operator <<' unless
renamed to a valid identifier.
/usr/include/zypp/ResStatus.h:56: Warning(503): Can't wrap 'operator ==' unless
renamed to a valid identifier.
/usr/include/zypp/Resolvable.h:42: Warning(503): Can't wrap 'operator <<'
unless renamed to a valid identifier.
/usr/include/zypp/ResObject.h:196: Warning(503): Can't wrap
'zypp::makeResObject' unless renamed to a valid identifier.
/usr/include/zypp/Package.h:122: Warning(503): Can't wrap 'zypp::make<(Self)>'
unless renamed to a valid identifier.
/usr/include/zypp/Patch.h:157: Warning(503): Can't wrap class
zypp::Patch::ReferenceIterator unless renamed to a valid identifier.
/usr/include/zypp/Product.h:171: Warning(503): Can't wrap class
zypp::Product::UrlList unless renamed to a valid identifier.
/usr/include/zypp/Repository.h:328: Warning(503): Can't wrap class
zypp::Repository::ProductInfoIterator unless renamed to a valid identifier.
/usr/include/zypp/Repository.h:388: Warning(503): Can't wrap class
zypp::Repository::EraseFromPool unless renamed to a valid identifier.
/usr/include/zypp/RepoStatus.h:39: Warning(503): Can't wrap 'operator <<'
unless renamed to a valid identifier.
/usr/include/zypp/RepoManager.h:109: Warning(503): Can't wrap 'operator <<'
unless renamed to a valid identifier.
/usr/include/zypp/PublicKey.h:78: Warning(503): Can't wrap 'operator <<' unless
renamed to a valid identifier.
/usr/include/zypp/KeyRing.h:134: Warning(503): Can't wrap 'operator <<' unless
renamed to a valid identifier.
/usr/include/zypp/Target.h:188: Warning(503): Can't wrap 'operator <<' unless
renamed to a valid identifier.
/usr/include/zypp/MediaSetAccess.h:79: Warning(503): Can't wrap 'operator <<'
unless renamed to a valid identifier.
/usr/include/zypp/PoolItem.h:52: Warning(503): Can't wrap 'operator <<' unless
renamed to a valid identifier.
/usr/include/zypp/PoolItem.h:124: Warning(503): Can't wrap 'operator
ResObject::constPtr' unless renamed to a valid identifier.
/usr/include/zypp/PoolItem.h:133: Warning(503): Can't wrap 'operator
ResObject::constPtr::unspecified_bool_type' unless renamed to a valid
identifier.
/usr/include/zypp/ResPool.h:49: Warning(503): Can't wrap 'operator <<' unless
renamed to a valid identifier.
/usr/include/zypp/TmpPath.h:62: Warning(503): Can't wrap 'operator const void*'
unless renamed to a valid identifier.
/usr/include/zypp/TmpPath.h:74: Warning(503): Can't wrap 'operator Pathname'
unless renamed to a valid identifier.
/usr/include/zypp/ZYppFactory.h:41: Warning(503): Can't wrap 'operator <<'
unless renamed to a valid identifier.
Processing types...
C++ analysis...
Generating wrappers...
cd /tmp/rpmbuild/libzypp-bindings-0.5.3/build/swig/python && /usr/bin/cmake -E
echo Done.
Done.
cd /tmp/rpmbuild/libzypp-bindings-0.5.3/build && /usr/bin/cmake -E
cmake_depends "Unix Makefiles" /tmp/rpmbuild/libzypp-bindings-0.5.3
/tmp/rpmbuild/libzypp-bindings-0.5.3/swig/python
/tmp/rpmbuild/libzypp-bindings-0.5.3/build
/tmp/rpmbuild/libzypp-bindings-0.5.3/build/swig/python
/tmp/rpmbuild/libzypp-bindings-0.5.3/build/swig/python/CMakeFiles/zypp_python.dir/DependInfo.cmake
--color=
Scanning dependencies of target zypp_python
make[2]: Leaving directory `/tmp/rpmbuild/libzypp-bindings-0.5.3/build'
make -f swig/python/CMakeFiles/zypp_python.dir/build.make
swig/python/CMakeFiles/zypp_python.dir/build
make[2]: Entering directory `/tmp/rpmbuild/libzypp-bindings-0.5.3/build'
/usr/bin/cmake -E cmake_progress_report
/tmp/rpmbuild/libzypp-bindings-0.5.3/build/CMakeFiles 3
[ 66%] Building CXX object
swig/python/CMakeFiles/zypp_python.dir/satsolver_python.cc.o
cd /tmp/rpmbuild/libzypp-bindings-0.5.3/build/swig/python &&
/opt/icecream/bin/g++ -Dzypp_python_EXPORTS -fPIC -fno-strict-aliasing
-fmessage-length=0 -O2 -Wall -D_FORTIFY_SOURCE=2 -fstack-protector
-funwind-tables -fasynchronous-unwind-tables -fPIC
-I/tmp/rpmbuild/libzypp-bindings-0.5.3
-I/tmp/rpmbuild/libzypp-bindings-0.5.3/build -I/usr/include/python2.6 -o
CMakeFiles/zypp_python.dir/satsolver_python.cc.o -c
/tmp/rpmbuild/libzypp-bindings-0.5.3/build/swig/python/satsolver_python.cc
/tmp/rpmbuild/libzypp-bindings-0.5.3/build/swig/python/satsolver_python.cc: In
function 'const zypp::Capability* zypp_Capabilities_haha(zypp::Capabilities*)':
/tmp/rpmbuild/libzypp-bindings-0.5.3/build/swig/python/satsolver_python.cc:3739:31:
warning: taking address of temporary
/tmp/rpmbuild/libzypp-bindings-0.5.3/build/swig/python/satsolver_python.cc: At
global scope:
/tmp/rpmbuild/libzypp-bindings-0.5.3/build/swig/python/satsolver_python.cc:5116:37:
error: 'PySwigIterator' in namespace 'swig' does not name a type
/tmp/rpmbuild/libzypp-bindings-0.5.3/build/swig/python/satsolver_python.cc:5120:37:
error: 'PySwigIterator' in namespace 'swig' does not name a type
/tmp/rpmbuild/libzypp-bindings-0.5.3/build/swig/python/satsolver_python.cc:5124:37:
error: 'PySwigIterator' in namespace 'swig' does not name a type
/tmp/rpmbuild/libzypp-bindings-0.5.3/build/swig/python/satsolver_python.cc: In
function 'PyObject* _wrap_Product_constPtr_type(PyObject*, PyObject*)':
/tmp/rpmbuild/libzypp-bindings-0.5.3/build/swig/python/satsolver_python.cc:64261:30:
warning: 'std::string zypp::Product::type() const' is deprecated (declared at
/usr/include/zypp/Product.h:97)
/tmp/rpmbuild/libzypp-bindings-0.5.3/build/swig/python/satsolver_python.cc: In
function 'PyObject* _wrap_Product_Ptr_type(PyObject*, PyObject*)':
/tmp/rpmbuild/libzypp-bindings-0.5.3/build/swig/python/satsolver_python.cc:67254:30:
warning: 'std::string zypp::Product::type() const' is deprecated (declared at
/usr/include/zypp/Product.h:97)
/tmp/rpmbuild/libzypp-bindings-0.5.3/build/swig/python/satsolver_python.cc: In
function 'PyObject* _wrap_Product_type(PyObject*, PyObject*)':
/tmp/rpmbuild/libzypp-bindings-0.5.3/build/swig/python/satsolver_python.cc:77297:52:
warning: 'std::string zypp::Product::type() const' is deprecated (declared at
/usr/include/zypp/Product.h:97)
/tmp/rpmbuild/libzypp-bindings-0.5.3/build/swig/python/satsolver_python.cc: In
function 'PyObject* _wrap_ResPool_iterator(PyObject*, PyObject*)':
/tmp/rpmbuild/libzypp-bindings-0.5.3/build/swig/python/satsolver_python.cc:102190:3:
error: 'PySwigIterator' is not a member of 'swig'
/tmp/rpmbuild/libzypp-bindings-0.5.3/build/swig/python/satsolver_python.cc:102190:25:
error: 'result' was not declared in this scope
/tmp/rpmbuild/libzypp-bindings-0.5.3/build/swig/python/satsolver_python.cc:102201:17:
error: 'PySwigIterator' is not a member of 'swig'
/tmp/rpmbuild/libzypp-bindings-0.5.3/build/swig/python/satsolver_python.cc:102201:39:
error: expected primary-expression before ')' token
/tmp/rpmbuild/libzypp-bindings-0.5.3/build/swig/python/satsolver_python.cc:102201:40:
error: expected ';' before 'zypp_ResPool_iterator'
/tmp/rpmbuild/libzypp-bindings-0.5.3/build/swig/python/satsolver_python.cc: In
function 'PyObject* _wrap_ResPool_kinditerator(PyObject*, PyObject*)':
/tmp/rpmbuild/libzypp-bindings-0.5.3/build/swig/python/satsolver_python.cc:102227:3:
error: 'PySwigIterator' is not a member of 'swig'
/tmp/rpmbuild/libzypp-bindings-0.5.3/build/swig/python/satsolver_python.cc:102227:25:
error: 'result' was not declared in this scope
/tmp/rpmbuild/libzypp-bindings-0.5.3/build/swig/python/satsolver_python.cc:102246:17:
error: 'PySwigIterator' is not a member of 'swig'
/tmp/rpmbuild/libzypp-bindings-0.5.3/build/swig/python/satsolver_python.cc:102246:39:
error: expected primary-expression before ')' token
/tmp/rpmbuild/libzypp-bindings-0.5.3/build/swig/python/satsolver_python.cc:102246:40:
error: expected ';' before 'zypp_ResPool_kinditerator'
/tmp/rpmbuild/libzypp-bindings-0.5.3/build/swig/python/satsolver_python.cc: In
function 'PyObject* _wrap_ResPool_nameiterator(PyObject*, PyObject*)':
/tmp/rpmbuild/libzypp-bindings-0.5.3/build/swig/python/satsolver_python.cc:102271:3:
error: 'PySwigIterator' is not a member of 'swig'
/tmp/rpmbuild/libzypp-bindings-0.5.3/build/swig/python/satsolver_python.cc:102271:25:
error: 'result' was not declared in this scope
/tmp/rpmbuild/libzypp-bindings-0.5.3/build/swig/python/satsolver_python.cc:102293:17:
error: 'PySwigIterator' is not a member of 'swig'
/tmp/rpmbuild/libzypp-bindings-0.5.3/build/swig/python/satsolver_python.cc:102293:39:
error: expected primary-expression before ')' token
/tmp/rpmbuild/libzypp-bindings-0.5.3/build/swig/python/satsolver_python.cc:102293:40:
error: expected ';' before 'zypp_ResPool_nameiterator'
ICECC[9374] 18:19:24: Compiled on 10.10.101.62
make[2]: *** [swig/python/CMakeFiles/zypp_python.dir/satsolver_python.cc.o]
Error 1
make[2]: Leaving directory `/tmp/rpmbuild/libzypp-bindings-0.5.3/build'
make[1]: *** [swig/python/CMakeFiles/zypp_python.dir/all] Error 2
make[1]: Leaving directory `/tmp/rpmbuild/libzypp-bindings-0.5.3/build'
make: *** [all] Error 2
error: Bad exit status from /var/tmp/rpm-tmp.soxgEa (%build)


RPM build errors:
Bad exit status from /var/tmp/rpm-tmp.soxgEa (%build)

( )
( ) (
) _ )
( \_
_(_\ \)__
(____\___))

build failed

stopping dbus..
Shutting down D-Bus daemon..done
... unmounting sys
... unmounting proc
... unmounting pts
[locks-and-latches] Releasing all the locks
[locks-and-latches] All the locks released
Archiving artifacts

--
To unsubscribe, e-mail: zypp-commit+unsubscribe@xxxxxxxxxxxx
For additional commands, e-mail: zypp-commit+help@xxxxxxxxxxxx

< Previous Next >