Mailinglist Archive: zypp-commit (73 mails)

< Previous Next >
[zypp-commit] Build failed in Hudson: libzypp-head-x86_64 #847
See <http://yast.suse.de:3334/job/libzypp-head-x86_64/847/changes>

Changes:

[J??n Kupec] some more test cases

[Michael Andres] backup

[Michael Andres] Test all installed instances to determine the locked
status.

[Michael Andres] Take care the last ServiceInfo::addRepoTo{Enable,Disable}
call wins.

[Michael Andres] Add RepoManager::modifyService convenience

[Michael Andres] Remember the enabled state of removed service
repositories. (bnc #572634)

[Michael Andres] changes 6.29.2

[Michael Andres] Use a tmp dir and not a fixed one.

[Michael Andres] Selectable status computation testcases added.

[Michael Andres] Replace .po files in source tree by tarballs.

- zypp-po.tar.bz2 contains the opensuse translation. They they are
mainatined at svn.berlios.de/svnroot/repos/opensuse-i18n.

- The via cmake -DUSE_TRANSLATION_SET one may define an alternate
translation tarball to use.

[Michael Andres] Fix install to pick the .gmo from CMAKE_CURRENT_BINARY_DIR

[Michael Andres] Add sle translations.

[Michael Andres] changes 6.29.3

[Michael Andres] Fix package-manager script wrongly escaping UTF-8 chars in
path names (bnc #571410)

[Michael Andres] changes 6.29.4

[Michael Andres] On SLE aria2 is not required, so conflict with too old
versions (bnc #578052)

[Michael Andres] changes 6.29.5

[J??n Kupec] Extracted pattern data to sperate pattern.rnc (bnc #473691)

[J??n Kupec] cleanCacheDirGarbage added (bnc #467693)

[J??n Kupec] changes

[J??n Kupec] typo

[Michael Andres] Consider pending disable requests when removing service
repositories. (bnc #572634)

[Michael Andres] Define SET_OPTION macro as single statement.

[Michael Andres] Turn off cookies when retrieving services repoindex.xml
(bnc #573897)

[Michael Andres] changes 6.30.1

[Michael Andres] Fix target svncheck to use git.

[J??n Kupec] Make CURLE_PARTIAL_FILE an auto-retry error (bnc #471436)

[J??n Kupec] changes

------------------------------------------
Started by an SCM change
Started by an SCM change
Started by an SCM change
Started by an SCM change
Started by an SCM change
Started by an SCM change
Started by an SCM change
Started by an SCM change
Started by upstream project "satsolver-head-x86_64" build number 592
Checkout
[workspace] $ git fetch
Checking out origin/master
[workspace] $ git checkout -f origin/master
Previous HEAD position was 16aad19... Workaround missing --root support when
creating the zypp lock file.
HEAD is now at 82434f6... changes
[workspace] $ git rev-parse origin/master
[workspace] $ git log --numstat -M --summary --pretty=raw
16aad191ad9ff5ee1262da42020920c85fef5d9d..82434f60abd48c68d8aec9a6a9d69158eec85af8
[locks-and-latches] Checking to see if we really have the locks
[locks-and-latches] Have all the locks, build can start
[workspace] $ /bin/sh -xe /tmp/hudson4159470915633456667.sh
+ sudo -E /data/hudson/bin/build-chroot.sh zypp libzypp head-x86_64
SCRIPT ID: I am /data/hudson/bin/build-chroot.sh at
<http://yast.suse.de:3334/job/libzypp-head-x86_64/ws/>
..copying source code <http://yast.suse.de:3334/job/libzypp-head-x86_64/ws/*>
/data/hudson/HUDSON-CHROOT/zypp-head-x86_64/src/libzypp
..copying make script to /data/hudson/HUDSON-CHROOT/zypp-head-x86_64/root
... mounting sys
... mounting proc
... mounting pts
... switching to chroot and starting build
SCRIPT ID: I am /root/make-zypp.sh at /

??,????????'????????,????,????????'????????,????,????????'????????,????,????????'????????,????,????????'????????,??


??,????????'????????,????,????????'????????,????,????????'????????,????,????????'????????,????,????????'????????,??

starting build of libzypp

-- The C compiler identification is GNU
-- The CXX compiler identification is GNU
-- Check for working C compiler: /opt/icecream/bin/gcc
-- Check for working C compiler: /opt/icecream/bin/gcc -- works
-- Detecting C compiler ABI info
-- Detecting C compiler ABI info - done
-- Check for working CXX compiler: /opt/icecream/bin/g++
-- Check for working CXX compiler: /opt/icecream/bin/g++ -- works
-- Detecting CXX compiler ABI info
-- Detecting CXX compiler ABI info - done
-- Libraries will be installed in /usr/lib64
-- Config files will be installed in /etc
** Manual files will be installed in /usr/share/man
-- Writing spec file...
-- I hate you rpm-lint...!!!
-- rpm found: includes in /usr/include, library in /usr/lib64/librpm.so
(suspect 4.x)
-- rpm found: enable rpm-4.4 legacy interface.
-- Boost version: 1.39.0
-- Found the following Boost libraries:
-- boost found: includes in /usr/include, library in /usr/lib
-- Found Gettext:
-- hal found: includes in /usr/include, library in /usr/lib64/libhal.so
-- dbus found: includes in /usr/include/dbus-1.0, library in
/usr/lib64/libdbus-1.so
-- curl found: includes in /usr/include, library in /usr/lib64/libcurl.so
-- libxml found: includes in /usr/include, library in /usr/lib64/libxml2.so
-- Found ZLIB: /usr/lib64/libz.so
-- satsolver found: includes in /usr/include, library in
/usr/lib64/libsatsolver.a /usr/lib64/libsatsolverext.a
-- Found EXPAT: /usr/lib64/libexpat.so
-- Found libcrypto: /usr/lib64/libcrypto.so
-- Found OpenSSL: /usr/lib64/libssl.so
-- doxygen found: /usr/bin/doxygen
-- soname: 619.11.2
-- version: 6.30.2
-- Writing pkg-config file...
-- FindZypp.cmake will be installed in /usr/share/cmake/Modules
-- zypp.conf will be installed in /etc/zypp
-- systemCheck will be installed in /etc/zypp
-- zsync not found
CMake Warning at devel/devel.ma/CMakeLists.txt:9 (MESSAGE):
qt3 not found


-- Translation set: zypp-po.tar.bz2
tar: Record size = 8 blocks
-- Translations:
es.po;bn.po;hr.po;nl.po;pt_BR.po;hi.po;km.po;bs.po;zh_CN.po;gl.po;id.po;et.po;mr.po;wa.po;el.po;en_US.po;sr.po;nb.po;af.po;pl.po;uk.po;ru.po;he.po;sl.po;lt.po;sk.po;it.po;xh.po;zu.po;de.po;hu.po;fr.po;en_GB.po;ca.po;vi.po;tr.po;fi.po;ja.po;da.po;be.po;ro.po;zh_TW.po;cy.po;tg.po;si.po;ko.po;bg.po;lo.po;mk.po;pt.po;ar.po;sv.po;gu.po;ka.po;th.po;ta.po;cs.po;pa.po;
-- CTest cannot determine repository type. Please set UPDATE_TYPE to 'cvs' or
'svn'. CTest update will not work.
-- Configuring done
-- Generating done
-- Build files have been written to: /build/libzypp
exit code: 0 ... good, lets continue
Scanning dependencies of target srcpackage
Scanning dependencies of target svncheck
/bin/sh: git: command not found
gmake[7]: *** [CMakeFiles/svncheck] Error 1
gmake[6]: *** [CMakeFiles/svncheck.dir/all] Error 2
gmake[5]: *** [CMakeFiles/svncheck.dir/rule] Error 2
gmake[4]: *** [svncheck] Error 2
make[3]: *** [CMakeFiles/srcpackage] Error 2
make[2]: *** [CMakeFiles/srcpackage.dir/all] Error 2
make[1]: *** [CMakeFiles/srcpackage.dir/rule] Error 2
make: *** [srcpackage] Error 2

( )
( ) (
) _ )
( \_
_(_\ \)__
(____\___))

build failed

stopping dbus..
Shutting down D-Bus daemon..done
... unmounting sys
... unmounting proc
... unmounting pts
[locks-and-latches] Releasing all the locks
[locks-and-latches] All the locks released
Archiving artifacts

--
To unsubscribe, e-mail: zypp-commit+unsubscribe@xxxxxxxxxxxx
For additional commands, e-mail: zypp-commit+help@xxxxxxxxxxxx

< Previous Next >