Mailinglist Archive: radeonhd (408 mails)

< Previous Next >
[radeonhd] build fails after latest 'git pull'
  • From: "David C. Rankin" <drankinatty@xxxxxxxxxxxxxxxxxx>
  • Date: Tue, 16 Jun 2009 09:48:34 -0500
  • Message-id: <4A37B0C2.7010402@xxxxxxxxxxxxxxxxxx>
Rafal,

After a 'git pull' last night, the build of the radeonhd driver failed with the following error. Recall, I have Rafal's downclocking patches installed and I had to do a commit -a before git pull would work properly. I was checking to see if any new packages addressed the heat issue with my laptop. Here is the error:


/usr/include/xorg/xf86str.h:1098: warning: comma at end of enumerator list
mv -f .deps/radeonhd_drv_la-rhd_pll.Tpo .deps/radeonhd_drv_la-rhd_pll.Plo
/bin/sh ../libtool --tag=CC --mode=compile gcc -DHAVE_CONFIG_H -I. -I.. -I./AtomBios/includes -I/usr/include/xorg -I/usr/include/pixman-1 -I/usr/include/drm -I/usr/include/X11/dri -Wall -Wextra -Wno-unused-parameter -Werror-implicit-function-declaration -Wstrict-aliasing -Wstrict-overflow -Wpointer-arith -Woverlength-strings -Wvolatile-register-var -Winit-self -Wbad-function-cast -Wstrict-prototypes -Wold-style-definition -Wnested-externs -Wdisabled-optimization -pedantic -Wno-long-long -Wno-variadic-macros -g -O2 -finline-functions -MT radeonhd_drv_la-rhd_pm.lo -MD -MP -MF .deps/radeonhd_drv_la-rhd_pm.Tpo -c -o radeonhd_drv_la-rhd_pm.lo `test -f 'rhd_pm.c' || echo './'`rhd_pm.c
libtool: compile: gcc -DHAVE_CONFIG_H -I. -I.. -I./AtomBios/includes -I/usr/include/xorg -I/usr/include/pixman-1 -I/usr/include/drm -I/usr/include/X11/dri -Wall -Wextra -Wno-unused-parameter -Werror-implicit-function-declaration -Wstrict-aliasing -Wstrict-overflow -Wpointer-arith -Woverlength-strings -Wvolatile-register-var -Winit-self -Wbad-function-cast -Wstrict-prototypes -Wold-style-definition -Wnested-externs -Wdisabled-optimization -pedantic -Wno-long-long -Wno-variadic-macros -g -O2 -finline-functions -MT radeonhd_drv_la-rhd_pm.lo -MD -MP -MF .deps/radeonhd_drv_la-rhd_pm.Tpo -c rhd_pm.c -fPIC -DPIC -o .libs/radeonhd_drv_la-rhd_pm.o
In file included from /usr/include/xorg/xf86.h:47,
from rhd_pm.c:33:
/usr/include/xorg/xf86str.h:1098: warning: comma at end of enumerator list
rhd_pm.c: In function ‘RHDPmSetClock’:
rhd_pm.c:108: error: expected expression before ‘<<’ token
rhd_pm.c:131:9: error: invalid suffix "a3fa92b6fdcd86b502973c947e5aed1bd3e1ada" on integer constant
rhd_pm.c:206:9: error: invalid suffix "a3fa92b6fdcd86b502973c947e5aed1bd3e1ada" on integer constant
rhd_pm.c:283: error: expected declaration or statement at end of input
make[3]: *** [radeonhd_drv_la-rhd_pm.lo] Error 1
make[3]: Leaving directory `/home/david/archlinux/apps/radeonhd/src'
make[2]: *** [all] Error 2
make[2]: Leaving directory `/home/david/archlinux/apps/radeonhd/src'
make[1]: *** [all-recursive] Error 1
make[1]: Leaving directory `/home/david/archlinux/apps/radeonhd'
make: *** [all] Error 2


Before I start deleting commas, I thought I would check with the experts. What do I need to do or delete to get my radeonhd build directory back in shape ?


--
David C. Rankin, J.D.,P.E.
Rankin Law Firm, PLLC
510 Ochiltree Street
Nacogdoches, Texas 75961
Telephone: (936) 715-9333
Facsimile: (936) 715-9339
www.rankinlawfirm.com
--
To unsubscribe, e-mail: radeonhd+unsubscribe@xxxxxxxxxxxx
For additional commands, e-mail: radeonhd+help@xxxxxxxxxxxx

< Previous Next >
Follow Ups