Mailinglist Archive: opensuse-ham (9 mails)

< Previous Next >
KPSK
  • From: Billie Erin Walsh <bilwalsh@xxxxxxxxxx>
  • Date: Fri, 29 Sep 2006 15:45:38 +0000 (UTC)
  • Message-id: <451D3F70.3030608@xxxxxxxxxx>
Perhaps I'm asking this in the wrong forum. It IS ham related but might
be better in some programming forum

Has anyone installed KPSK?

I downloaded the tar ball. extracted it and ran configure without a
hitch. The problem started with make. [ I'm a "newbie" when it comes to
Linux so I'm still kind of on the lower upswing of the learning curve. ]

This is the output on the terminal screen:

****************************************
Good - your configure finished. Start make now

linux:/home/Billie0w/kpsk-1.0.1 # make
cd . \
&& CONFIG_FILES= CONFIG_HEADERS=config.h \
/bin/sh ./config.status
config.status: creating config.h
config.status: config.h is unchanged
config.status: executing default-1 commands
make all-recursive
make[1]: Entering directory `/home/Billie0w/kpsk-1.0.1'
Making all in kpsk
make[2]: Entering directory `/home/Billie0w/kpsk-1.0.1/kpsk'
Making all in server
make[3]: Entering directory `/home/Billie0w/kpsk-1.0.1/kpsk/server'
make[3]: Nothing to be done for `all'.
make[3]: Leaving directory `/home/Billie0w/kpsk-1.0.1/kpsk/server'
Making all in modes
make[3]: Entering directory `/home/Billie0w/kpsk-1.0.1/kpsk/modes'
source='psk31-fft.C' object='psk31-fft.o' libtool=no \
depfile='.deps/psk31-fft.Po' tmpdepfile='.deps/psk31-fft.TPo' \
depmode=gcc3 /bin/sh ../../admin/depcomp \
g++ -DHAVE_CONFIG_H -I. -I. -I../.. -I/opt/kde3/include
-I/usr/lib/qt3/include -I/usr/X11R6/include -DQT_THREAD_SUPPORT
-D_REENTRANT -Wnon-virtual-dtor -Wno-long-long -Wundef -Wall -pedantic
-W -Wpointer-arith -Wmissing-prototypes -Wwrite-strings -ansi
-D_XOPEN_SOURCE=500 -D_BSD_SOURCE -Wcast-align -Wconversion -O2
-fno-exceptions -fno-check-new -c -o psk31-fft.o `test -f psk31-fft.C
|| echo './'`psk31-fft.C
cc1plus: warning: command line option "-Wmissing-prototypes" is valid
for Ada/C/ObjC but not for C++
psk31-fft.C:113: error: extra ‘;’
make[3]: *** [psk31-fft.o] Error 1
make[3]: Leaving directory `/home/Billie0w/kpsk-1.0.1/kpsk/modes'
make[2]: *** [all-recursive] Error 1
make[2]: Leaving directory `/home/Billie0w/kpsk-1.0.1/kpsk'
make[1]: *** [all-recursive] Error 1
make[1]: Leaving directory `/home/Billie0w/kpsk-1.0.1'
make: *** [all] Error 2
***********************************************

I don't understand the problem [ I guess is the closest I can come to
saying it] but wonder if the line "psk31-fft.C:113: error: extra ‘;’" is
the source of my ills. At least that is where things seem to be exiting
make.

--
(o:]>HUGGLES*<[:o)<br>
Billie Walsh<br>
KA5LSU
The three best words in the English Language:<br>
"I LOVE YOU"<br>
Pass them on!


< Previous Next >
Follow Ups