Mailinglist Archive: opensuse-es (1524 mails)

< Previous Next >
Re: [suse-linux-s] error al compilar
  • From: Chema Ollés <jmolles@xxxxxxxxxxx>
  • Date: Tue, 12 Apr 2005 20:48:18 +0200
  • Message-id: <425C17F2.2020105@xxxxxxxxxxx>
-----BEGIN PGP SIGNED MESSAGE-----
Hash: SHA1

Manel escribió:
> Hola a todos:
> Intento de compilar el kernel y al hacer el make me da este error, que
> os pongo aqui abajo.
> Alguno puede darme algo de luz.
> Gracias
> Saludos
> Manel
>
> suse:/usr/src/kernel-source-2.6.8# make
> make[1]: `arch/x86_64/kernel/asm-offsets.s' is up to date.
> CHK include/linux/compile.h
> CC drivers/char/drm/radeon_state.o
> drivers/char/drm/radeon_state.c: In function `radeon_cp_cmdbuf'
> drivers/char/drm/radeon_state.c:2317: warning: implicit declara
> drivers/char/drm/radeon_state.c:2317: warning: assignment makes
> drivers/char/drm/radeon_state.c:2418:58: macro "DRM_FREE" passe
> drivers/char/drm/radeon_state.c:2418: error: `DRM_FREE' undecla
> drivers/char/drm/radeon_state.c:2418: error: (Each undeclared i
> drivers/char/drm/radeon_state.c:2418: error: for each function
> drivers/char/drm/radeon_state.c:2427:58: macro "DRM_FREE" passe
> make[3]: *** [drivers/char/drm/radeon_state.o] Error 1
> make[2]: *** [drivers/char/drm] Error 2
> make[1]: *** [drivers/char] Error 2
> make: *** [drivers] Error 2
> suse:/usr/src/kernel-source-2.6.8#
>
Hola:
Según se ve en los mensajes de error que envias,existe un problema a la
hora de compilar los drivers para radeon.
Haz un make clean y vuelve a empezar... a ver que pasa ;)
Mi opinión:
Si quieres compilar el kernel bájate las últimas versiones,esta que
tienes está un poco pasadita ya...
Salu2
- --
Chema Ollés
Usuario Linux: #198057
Linux 2.6.11-rc5 #3 SMP Sun Feb 27 20:45:31 CET 2005 i686
-----BEGIN PGP SIGNATURE-----
Version: GnuPG v1.2.4 (GNU/Linux)

iD8DBQFCXBfy65SpD7GhbzoRAtdiAJ9pHCX4odSCplv/l1VRjNSnNbS+/wCfSTpU
DUwR3jog2JqAkYrtrIodR5U=
=xv++
-----END PGP SIGNATURE-----

< Previous Next >
References