Mailinglist Archive: opensuse-es (1524 mails)

< Previous Next >
error al compilar
  • From: Manel <susero@xxxxxxxxx>
  • Date: Tue, 12 Apr 2005 20:21:35 +0200
  • Message-id: <425C11AF.1060300@xxxxxxxxx>
Hola a todos:
Intento de compilar el kernel y al hacer el make me da este error, que os pongo aqui abajo.
Alguno puede darme algo de luz.
Gracias
Saludos
Manel

suse:/usr/src/kernel-source-2.6.8# make
make[1]: `arch/x86_64/kernel/asm-offsets.s' is up to date.
CHK include/linux/compile.h
CC drivers/char/drm/radeon_state.o
drivers/char/drm/radeon_state.c: In function `radeon_cp_cmdbuf'
drivers/char/drm/radeon_state.c:2317: warning: implicit declara
drivers/char/drm/radeon_state.c:2317: warning: assignment makes
drivers/char/drm/radeon_state.c:2418:58: macro "DRM_FREE" passe
drivers/char/drm/radeon_state.c:2418: error: `DRM_FREE' undecla
drivers/char/drm/radeon_state.c:2418: error: (Each undeclared i
drivers/char/drm/radeon_state.c:2418: error: for each function
drivers/char/drm/radeon_state.c:2427:58: macro "DRM_FREE" passe
make[3]: *** [drivers/char/drm/radeon_state.o] Error 1
make[2]: *** [drivers/char/drm] Error 2
make[1]: *** [drivers/char] Error 2
make: *** [drivers] Error 2
suse:/usr/src/kernel-source-2.6.8#

< Previous Next >