Mailinglist Archive: opensuse-de (1208 mails)

< Previous Next >
configure-make funktioniert nicht
  • From: Kai <kt.kraemer@xxxxxx>
  • Date: Sun, 01 Jun 2008 23:31:40 +0200
  • Message-id: <1212355900.6602.4.camel@xxxxxxxxxxxxxxxxx>
Hallo Liste.
Ich habe mein Notebook neu aufgesetzt - Opensuse10.3/32.
Nun bekomme ich kein ./configure && make mehr hin.

Ich habe gcc-c++ und die Kernelquellen schon nach-installiert. Ich weiß
aber nicht, was mir noch zum Dreisatz fehlt :-(

Danke,
Kai

---SCHNIPP---
notebook:/local/iperf-2.0.4 # ./configure
checking for a BSD-compatible install... /usr/bin/install -c
checking whether build environment is sane... yes
checking for gawk... gawk
checking whether make sets $(MAKE)... yes
checking for g++... g++
checking for C++ compiler default output file name... a.out
checking whether the C++ compiler works... yes
checking whether we are cross compiling... no
checking for suffix of executables...
checking for suffix of object files... o
checking whether we are using the GNU C++ compiler... yes
checking whether g++ accepts -g... yes
checking for style of include used by make... GNU
checking dependency style of g++... gcc3
checking for gcc... gcc
checking whether we are using the GNU C compiler... yes
checking whether gcc accepts -g... yes
checking for gcc option to accept ISO C89... none needed
checking dependency style of gcc... gcc3
checking for strerror in -lcposix... no
checking for a BSD-compatible install... /usr/bin/install -c
checking whether make sets $(MAKE)... (cached) yes
checking for ranlib... ranlib
checking build system type... i686-pc-linux-gnu
checking host system type... i686-pc-linux-gnu
checking for the pthreads library -lpthreads... no
checking whether pthreads work without any flags... no
checking whether pthreads work with -Kthread... no
checking whether pthreads work with -kthread... no
checking for the pthreads library -llthread... no
checking whether pthreads work with -pthread... yes
checking for joinable pthread attribute... PTHREAD_CREATE_JOINABLE
checking if more special flags are required for pthreads... no
checking for cc_r... gcc
checking for gethostbyname... no
checking for gethostbyname in -lnsl... yes
checking for socket... no
checking for socket in -lsocket... no
checking how to run the C preprocessor... /lib/cpp
configure: error: C preprocessor "/lib/cpp" fails sanity check
See `config.log' for more details.
---SCHNAPP---

---SCHNIPP---
notebook:/local/iperf-2.0.4 # make
make all-recursive
make[1]: Entering directory `/local/iperf-2.0.4'
Making all in compat
make[2]: Entering directory `/local/iperf-2.0.4/compat'
if gcc -DHAVE_CONFIG_H -I. -I. -I.. -I../include -I../include -Wall
-O2 -MT Thread.o -MD -MP -MF ".deps/Thread.Tpo" -c -o Thread.o
Thread.c; \
then mv -f ".deps/Thread.Tpo" ".deps/Thread.Po"; else rm -f
".deps/Thread.Tpo"; exit 1; fi
In file included from /usr/include/errno.h:36,
from ../include/headers.h:82,
from Thread.c:71:
/usr/include/bits/errno.h:25:26: error: linux/errno.h: Datei oder
Verzeichnis nicht gefunden
In file included from /usr/include/bits/posix1_lim.h:153,
from /usr/include/limits.h:145,

from /usr/lib/gcc/i586-suse-linux/4.2.1/include/limits.h:122,

from /usr/lib/gcc/i586-suse-linux/4.2.1/include/syslimits.h:7,

from /usr/lib/gcc/i586-suse-linux/4.2.1/include/limits.h:11,
from /usr/include/bits/socket.h:32,
from /usr/include/sys/socket.h:35,
from ../include/headers.h:133,
from Thread.c:71:
/usr/include/bits/local_lim.h:36:26: error: linux/limits.h: Datei oder
Verzeichnis nicht gefunden
In file included from /usr/include/sys/socket.h:35,
from ../include/headers.h:133,
from Thread.c:71:
/usr/include/bits/socket.h:311:24: error: asm/socket.h: Datei oder
Verzeichnis nicht gefunden
In file included from /usr/include/signal.h:333,
from ../include/headers.h:135,
from Thread.c:71:
/usr/include/bits/sigcontext.h:28:29: error: asm/sigcontext.h: Datei
oder Verzeichnis nicht gefunden
Thread.c: In function ‘thread_destroy’:
Thread.c:113: error: ‘EBUSY’ undeclared (first use in this function)
Thread.c:113: error: (Each undeclared identifier is reported only once
Thread.c:113: error: for each function it appears in.)
make[2]: *** [Thread.o] Fehler 1
make[2]: Leaving directory `/local/iperf-2.0.4/compat'
make[1]: *** [all-recursive] Fehler 1
make[1]: Leaving directory `/local/iperf-2.0.4'
make: *** [all] Fehler 2
---SCHNAPP---

--
Um die Liste abzubestellen, schicken Sie eine Mail an:
opensuse-de+unsubscribe@xxxxxxxxxxxx
Um eine Liste aller verfuegbaren Kommandos zu bekommen, schicken
Sie eine Mail an: opensuse-de+help@xxxxxxxxxxxx

< Previous Next >