Mailinglist Archive: opensuse-buildservice (216 mails)

< Previous Next >
[opensuse-buildservice] Modules Error during build
  • From: <Jan.Albrecht@xxxxxxxxxxxxxx>
  • Date: Mon, 22 Mar 2010 14:15:38 +0100
  • Message-id: <D9E11424B7617B45BBC97B21A517434B89F048DB@xxxxxxxxxxxxxxxxxxxxxxxxx>
Hi,

currently we try to build a package, but that does fail.

************************************************

build36 started "build heartbeat-suse.spec" at Mon Mar 22 11:31:58 UTC 2010.

Building heartbeat for project 'home:nmidc:pacemaker' repository 'SLE_10' arch
'i586' srcmd5 '5ec8f40fddb197fbcc22c7910573fded'

[.]

modprobe: FATAL: Could not load /lib/modules/2.6.27.42-0.1-xen/modules.dep: No
such file or directory

error : Resource temporarily unavailable
warning: failed to load external entity
"http://docbook.sourceforge.net/release/xsl/current/manpages/docbook.xsl";
cannot parse
http://docbook.sourceforge.net/release/xsl/current/manpages/docbook.xsl
gmake[1]: *** [heartbeat.8] Error 4
gmake[1]: *** Waiting for unfinished jobs....
modprobe: FATAL: Could not load /lib/modules/2.6.27.42-0.1-xen/modules.dep: No
such file or directory

error : Resource temporarily unavailable
warning: failed to load external entity
"http://docbook.sourceforge.net/release/xsl/current/manpages/docbook.xsl";
cannot parse
http://docbook.sourceforge.net/release/xsl/current/manpages/docbook.xsl
gmake[1]: *** [apphbd.8] Error 4
modprobe: FATAL: Could not load /lib/modules/2.6.27.42-0.1-xen/modules.dep: No
such file or directory

error : Resource temporarily unavailable
warning: failed to load external entity
"http://docbook.sourceforge.net/release/xsl/current/manpages/docbook.xsl";
cannot parse
http://docbook.sourceforge.net/release/xsl/current/manpages/docbook.xsl
gmake[1]: *** [cl_status.1] Error 4
make: *** [all-recursive] Error 1
error: Bad exit status from /var/tmp/rpm-tmp.50233 (%build)


RPM build errors:
    cannot open Pubkeys index using db3 - No such file or directory (2)
    Bad exit status from /var/tmp/rpm-tmp.50233 (%build)
modprobe: FATAL: Could not load /lib/modules/2.6.27.42-0.1-xen/modules.dep: No
such file or directory

error : Resource temporarily unavailable
warning: failed to load external entity
"http://docbook.sourceforge.net/release/xsl/current/manpages/docbook.xsl";
cannot parse
http://docbook.sourceforge.net/release/xsl/current/manpages/docbook.xsl
mount: / is busy
System halted.

****************************************

I assume these Errors are from the virtual build machine, not from our package.
Is there something broken in the build service? We tried it the third time and
still receiving the same error.

Thanks for your help,
Jan


--
To unsubscribe, e-mail: opensuse-buildservice+unsubscribe@xxxxxxxxxxxx
For additional commands, e-mail: opensuse-buildservice+help@xxxxxxxxxxxx

< Previous Next >