Mailinglist Archive: opensuse-buildservice (248 mails)

< Previous Next >
Re: [opensuse-buildservice] inconsistent buildservice behaviour with compile flags?
  • From: Adrian Schröter <adrian@xxxxxxx>
  • Date: Fri, 16 Oct 2009 13:35:34 +0200
  • Message-id: <200910161335.34172.adrian@xxxxxxx>
Am Freitag, 16. Oktober 2009 13:28:54 schrieb Mathias Homann:

I'm having the strangest thing with a package on the build service...

sometimes a build fails with the following output:
[ 1%] Building CXX object
cc1plus: warnings being treated as errors
In file included from
/usr/src/packages/BUILD/linden/indra/llcharacter/llkeyframemotion.h: In
error: 'LLKeyframeMotion::JointConstraintSharedData::mConstraintTargetType'
will be initialized after
error: 'S32
error: when initialized here
make[2]: *** [llcharacter/CMakeFiles/llcharacter.dir/llbvhloader.cpp.o]
Error 1
make[1]: *** [llcharacter/CMakeFiles/llcharacter.dir/all] Error 2
make: *** [all] Error 2

and sometimes the build works just fine, with no changes to source or

Seems that there is some randmness involved that sometimes compiles with
-Werror and sometimes without that flag.

Don't think that is expected behaviour, is it?

Hard to say without code snippets. However, you should ask the tool chain folk
in first place, I think.


Adrian Schroeter
SUSE Linux Products GmbH
email: adrian@xxxxxxx

To unsubscribe, e-mail: opensuse-buildservice+unsubscribe@xxxxxxxxxxxx
For additional commands, e-mail: opensuse-buildservice+help@xxxxxxxxxxxx

< Previous Next >
Follow Ups